program: Orca
programVersion: 4.2.1
elementType: O O O N N N N C C C C C C C C C C C C C C H H H H H H H H H H H H H H H H H H
charge: 0
multiplicity: 1
keywords: wb97x-d3
keywords: def2-TZVPP
keywords: def2/J RIJCOSX GRIDX6 NOFINALGRIDX
keywords: grid4 nofinalgrid
keywords: scfconv7
keywords: smallprint printgap noloewdin
keywords: NOSOSCF
formula: C14H18N4O3
InChI: InChI=1S/C14H18N4O3/c1-3-4-9-15-13(19)18-11-8-6-5-7-10(11)16-12(18)17-14(20)21-2/h5-8,15-16H,3-4,9H2,1-2H3
39 atoms
O  -0.613971 -2.638846 -0.760839
O  2.542799 2.588194 0.071471
O  0.506641 3.382771 0.553121
N  -0.85366 -0.40571 -0.413904
N  1.209014 -1.316826 -1.016043
N  -1.484869 1.59304 0.225885
N  0.850602 1.206959 -0.166701
C  2.768349 -2.891859 0.107091
C  2.156291 -2.400164 -1.197225
C  -2.249704 -0.443246 -0.261071
C  3.606898 -1.840437 0.8223
C  -2.631304 0.833376 0.142354
C  -0.408026 0.867118 -0.109036
C  -0.068596 -1.550007 -0.735107
C  -3.204733 -1.430151 -0.453226
C  -3.947338 1.179103 0.379881
C  4.23293 -2.365791 2.104492
C  -4.531532 -1.088867 -0.2170
C  -4.900989 0.188908 0.194775
C  1.221441 2.464081 0.182466
C  3.107467 3.852035 0.406475
H  3.394313 -3.75834 -0.125385
H  1.975146 -3.254077 0.768581
H  1.665562 -3.218848 -1.7208
H  2.940279 -2.032202 -1.859894
H  4.39364 -1.488487 0.147902
H  2.993638 -0.965774 1.05622
H  1.557688 -0.377263 -0.837277
H  -2.95066 -2.426364 -0.772756
H  -4.217052 2.178534 0.692265
H  4.831183 -1.599501 2.598874
H  3.469894 -2.694106 2.812754
H  4.886678 -3.21753 1.907669
H  -5.294044 -1.842317 -0.359829
H  -5.943771 0.415028 0.370235
H  2.919502 4.116369 1.447233
H  4.178766 3.748391 0.256794
H  2.735183 4.646612 -0.240405
H  -1.419158 2.564645 0.495465
elementType: O N C H
totalener: -989.19863667 hartree
nucrepener: 1701.69975746 hartree
electener: -2690.89839412 hartree
oneelecener: -4726.24657709 hartree
twoeener: 2035.34818297 hartree
cpcmener: -0.03047523 hartree
kineticenergy: 985.02795085 hartree
xcener: -94.233878165171 hartree
chargesum: -0.0000000
charge: -0.536941 -0.317805 -0.549878 -0.035621 -0.241248 -0.138701 -0.477296 -0.104739 -0.050440 0.110523 -0.081353 0.059276 0.385511 0.423274 -0.204217 -0.171592 -0.282275 -0.160395 -0.146845 0.526786 -0.125057 0.075551 0.067309 0.099427 0.108872 0.063479 0.043045 0.203559 0.161007 0.158291 0.091498 0.079368 0.081190 0.161569 0.163407 0.114349 0.127123 0.114444 0.205546
qa: -0.5369 -0.3178 -0.5499 -0.0356 -0.2412 -0.1387 -0.4773 -0.1047 -0.0504 0.1105 -0.0814 0.0593 0.3855 0.4233 -0.2042 -0.1716 -0.2823 -0.1604 -0.1468 0.5268 -0.1251 0.0756 0.0673 0.0994 0.1089 0.0635 0.0430 0.2036 0.1610 0.1583 0.0915 0.0794 0.0812 0.1616 0.1634 0.1143 0.1271 0.1144 0.2055
va: 1.9679 2.0762 1.9358 3.2910 3.2161 3.4323 2.8625 3.8350 3.8760 3.7761 3.8614 3.8701 4.1078 4.2520 3.9887 3.9411 3.9538 3.9089 3.8885 4.2609 3.8732 1.0141 1.0157 1.0202 1.0016 1.0056 1.0249 1.0523 1.0258 0.9988 1.0029 1.0007 1.0009 0.9912 0.9882 0.9934 0.9956 0.9935 1.0246
dispcorr: -0.016320379 hartree
energy: -989.214957043948
dipole: 20.83575 -20.71625 0.11950 -8.78892 9.86119 1.07227 6.11659 -5.96631 0.15028
magnitude: 1.08932 au
magnitude: 2.76884 debye
