program: Orca
programVersion: 4.2.1
elementType: O O O N N N N C C C C C C C C C C C C C C H H H H H H H H H H H H H H H H H H
charge: 0
multiplicity: 1
keywords: wb97x-d3
keywords: def2-TZVPP
keywords: def2/J RIJCOSX GRIDX6 NOFINALGRIDX
keywords: grid4 nofinalgrid
keywords: scfconv7
keywords: smallprint printgap noloewdin
keywords: NOSOSCF
formula: C14H18N4O3
InChI: InChI=1S/C14H18N4O3/c1-3-4-9-15-13(19)18-11-8-6-5-7-10(11)16-12(18)17-14(20)21-2/h5-8,15-16H,3-4,9H2,1-2H3
39 atoms
O  -0.691483 -2.686725 -0.754423
O  2.573875 2.469092 0.111763
O  0.549434 3.310201 0.56273
N  -0.884093 -0.448656 -0.406798
N  1.153953 -1.393967 -1.022187
N  -1.475499 1.569199 0.211855
N  0.853552 1.128135 -0.155329
C  3.355848 -2.215998 -0.340276
C  2.119844 -2.464094 -1.191378
C  -2.281437 -0.454149 -0.263224
C  3.08623 -2.234233 1.15859
C  -2.637805 0.834429 0.12564
C  -0.413074 0.816695 -0.108308
C  -0.124096 -1.608885 -0.734675
C  -3.257568 -1.421719 -0.447756
C  -3.946968 1.2128 0.350005
C  4.335775 -1.946283 1.976329
C  -4.577783 -1.047772 -0.224214
C  -4.921753 0.24284 0.169015
C  1.248992 2.375195 0.203361
C  3.161473 3.717738 0.462582
H  3.806734 -1.259562 -0.626307
H  4.092425 -2.983598 -0.591515
H  1.658635 -3.412949 -0.921528
H  2.402435 -2.536168 -2.243577
H  2.317511 -1.498324 1.408367
H  2.677062 -3.209109 1.439255
H  1.505135 -0.449626 -0.866757
H  -3.025149 -2.427913 -0.752128
H  -4.194517 2.221627 0.650083
H  5.118528 -2.681705 1.781941
H  4.74376 -0.961975 1.738913
H  4.125446 -1.964466 3.046196
H  -5.355759 -1.786151 -0.361998
H  -5.960347 0.494316 0.334172
H  2.961088 3.98176 1.501274
H  4.232438 3.590081 0.331508
H  2.818891 4.524055 -0.186244
H  -1.387933 2.5403 0.476952
elementType: O N C H
totalener: -989.19713286 hartree
nucrepener: 1706.08017965 hartree
electener: -2695.27731251 hartree
oneelecener: -4734.98771619 hartree
twoeener: 2039.71040369 hartree
cpcmener: -0.03026993 hartree
kineticenergy: 985.03201270 hartree
xcener: -94.235189195922 hartree
chargesum: 0.0000000
charge: -0.536772 -0.315055 -0.550512 -0.035607 -0.232913 -0.137932 -0.477527 -0.105910 -0.045226 0.108033 -0.088958 0.061033 0.386655 0.423468 -0.203678 -0.171473 -0.277988 -0.159918 -0.147624 0.524498 -0.125296 0.065234 0.076014 0.096226 0.105198 0.054220 0.063946 0.191970 0.160600 0.157892 0.081461 0.077395 0.092253 0.161544 0.163085 0.114161 0.127059 0.114329 0.206118
qa: -0.5368 -0.3151 -0.5505 -0.0356 -0.2329 -0.1379 -0.4775 -0.1059 -0.0452 0.1080 -0.0890 0.0610 0.3867 0.4235 -0.2037 -0.1715 -0.2780 -0.1599 -0.1476 0.5245 -0.1253 0.0652 0.0760 0.0962 0.1052 0.0542 0.0639 0.1920 0.1606 0.1579 0.0815 0.0774 0.0923 0.1615 0.1631 0.1142 0.1271 0.1143 0.2061
va: 1.9723 2.0786 1.9339 3.2877 3.2193 3.4336 2.8636 3.8649 3.8745 3.7798 3.8539 3.8674 4.1014 4.2435 3.9909 3.9419 3.9447 3.9082 3.8890 4.2662 3.8720 1.0120 1.0146 1.0238 1.0013 1.0224 1.0090 1.0630 1.0259 0.9990 1.0001 1.0025 1.0029 0.9911 0.9883 0.9935 0.9957 0.9936 1.0246
dispcorr: -0.016427381 hartree
energy: -989.213560236148
dipole: 21.26995 -21.09159 0.17836 -7.47244 8.55409 1.08164 5.80732 -5.65773 0.14959
magnitude: 1.10641 au
magnitude: 2.81227 debye
