program: Orca
programVersion: 4.2.1
elementType: O O O N N N N C C C C C C C C C C C C C C H H H H H H H H H H H H H H H H H H
charge: 0
multiplicity: 1
keywords: wb97x-d3
keywords: def2-TZVPP
keywords: def2/J RIJCOSX GRIDX6 NOFINALGRIDX
keywords: grid4 nofinalgrid
keywords: scfconv7
keywords: smallprint printgap noloewdin
keywords: NOSOSCF
formula: C14H18N4O3
InChI: InChI=1S/C14H18N4O3/c1-3-4-9-15-13(19)18-11-8-6-5-7-10(11)16-12(18)17-14(20)21-2/h5-8,15-16H,3-4,9H2,1-2H3
39 atoms
O  -0.603872 -2.646546 -0.80244
O  2.558562 2.584757 0.054419
O  0.51973 3.372903 0.533123
N  -0.833802 -0.420609 -0.411022
N  1.214156 -1.313888 -1.072208
N  -1.460842 1.578834 0.230311
N  0.872249 1.19315 -0.170622
C  3.333092 -2.257475 -0.265193
C  2.198607 -2.360028 -1.273582
C  -2.228611 -0.458639 -0.245931
C  2.895688 -2.458687 1.179293
C  -2.607527 0.818823 0.157544
C  -0.386466 0.852294 -0.109439
C  -0.055217 -1.559474 -0.769679
C  -3.185479 -1.447169 -0.420661
C  -3.920987 1.165453 0.407224
C  4.056467 -2.342968 2.155359
C  -4.509796 -1.105447 -0.171322
C  -4.876232 0.174266 0.23701
C  1.238358 2.454172 0.169667
C  3.115707 3.854099 0.381467
H  3.827536 -1.285858 -0.371534
H  4.082355 -3.007729 -0.532186
H  1.710817 -3.330092 -1.198836
H  2.596645 -2.282707 -2.286856
H  2.130471 -1.72296 1.442621
H  2.423725 -3.440367 1.280697
H  1.550211 -0.366402 -0.904408
H  -2.935075 -2.445782 -0.73538
H  -4.186685 2.166231 0.718758
H  4.521672 -1.356853 2.100161
H  3.73001 -2.49411 3.184811
H  4.830773 -3.082729 1.943655
H  -5.272901 -1.860794 -0.30023
H  -5.917202 0.400537 0.42266
H  2.735748 4.643436 -0.267409
H  2.929196 4.121883 1.42167
H  4.18709 3.757391 0.228725
H  -1.390329 2.550404 0.499361
elementType: O N C H
totalener: -989.19781563 hartree
nucrepener: 1704.78201087 hartree
electener: -2693.97982651 hartree
oneelecener: -4732.42570114 hartree
twoeener: 2038.44587464 hartree
cpcmener: -0.03044956 hartree
kineticenergy: 985.03233993 hartree
xcener: -94.235355369347 hartree
chargesum: -0.0000000
charge: -0.535622 -0.317859 -0.550012 -0.035163 -0.232691 -0.138216 -0.480453 -0.106740 -0.043139 0.108858 -0.084781 0.060541 0.387891 0.415180 -0.203897 -0.172194 -0.280701 -0.160513 -0.146850 0.525649 -0.125100 0.066440 0.074283 0.096856 0.106145 0.055497 0.063219 0.195742 0.161298 0.158059 0.078271 0.091868 0.080975 0.161620 0.163220 0.114285 0.114519 0.127333 0.206180
qa: -0.5356 -0.3179 -0.5500 -0.0352 -0.2327 -0.1382 -0.4805 -0.1067 -0.0431 0.1089 -0.0848 0.0605 0.3879 0.4152 -0.2039 -0.1722 -0.2807 -0.1605 -0.1468 0.5256 -0.1251 0.0664 0.0743 0.0969 0.1061 0.0555 0.0632 0.1957 0.1613 0.1581 0.0783 0.0919 0.0810 0.1616 0.1632 0.1143 0.1145 0.1273 0.2062
va: 1.9712 2.0761 1.9338 3.2883 3.2186 3.4326 2.8601 3.8548 3.8665 3.7799 3.8518 3.8681 4.1011 4.2500 3.9901 3.9431 3.9449 3.9084 3.8896 4.2657 3.8720 1.0127 1.0152 1.0260 1.0017 1.0202 1.0090 1.0586 1.0260 0.9989 1.0014 1.0031 1.0001 0.9911 0.9883 0.9935 0.9935 0.9957 1.0249
dispcorr: -0.016356952 hartree
energy: -989.214172585563
dipole: 20.30631 -20.16185 0.14446 -8.55729 9.62780 1.07051 6.19408 -6.03205 0.16204
magnitude: 1.09230 au
magnitude: 2.77641 debye
