program: Orca
programVersion: 4.2.1
elementType: O O O N N N N C C C C C C C C C C C C C C H H H H H H H H H H H H H H H H H H
charge: 0
multiplicity: 1
keywords: wb97x-d3
keywords: def2-TZVPP
keywords: def2/J RIJCOSX GRIDX6 NOFINALGRIDX
keywords: grid4 nofinalgrid
keywords: scfconv7
keywords: smallprint printgap noloewdin
keywords: NOSOSCF
formula: C14H18N4O3
InChI: InChI=1S/C14H18N4O3/c1-3-4-9-15-13(19)18-11-8-6-5-7-10(11)16-12(18)17-14(20)21-2/h5-8,15-16H,3-4,9H2,1-2H3
39 atoms
O  -0.731483 -2.695018 -0.686629
O  2.568743 2.428912 0.161607
O  0.548757 3.307236 0.560253
N  -0.912319 -0.449463 -0.39169
N  1.131144 -1.423518 -0.947884
N  -1.495953 1.576754 0.208821
N  0.834479 1.111188 -0.121107
C  2.865509 -2.77523 0.192193
C  2.074618 -2.516729 -1.082554
C  -2.31191 -0.441927 -0.270697
C  3.772133 -1.618572 0.596041
C  -2.663048 0.851169 0.108346
C  -0.435517 0.813067 -0.091189
C  -0.154538 -1.622241 -0.676415
C  -3.293017 -1.401083 -0.471882
C  -3.972512 1.24039 0.312312
C  4.563764 -1.912147 1.860675
C  -4.613319 -1.015974 -0.269136
C  -4.952124 0.277747 0.118635
C  1.24099 2.356768 0.2285
C  3.169846 3.67624 0.494818
H  3.473642 -3.670153 0.031455
H  2.172724 -3.013123 1.005451
H  1.537895 -3.412619 -1.38671
H  2.756138 -2.268714 -1.898022
H  4.461899 -1.4009 -0.225099
H  3.184016 -0.708634 0.748039
H  1.490836 -0.483643 -0.790917
H  -3.06404 -2.409047 -0.773003
H  -4.217655 2.25129 0.607077
H  3.902079 -2.094242 2.70936
H  5.193329 -2.795468 1.739125
H  5.214723 -1.078172 2.125268
H  -5.395478 -1.747584 -0.418851
H  -5.990838 0.538101 0.268615
H  2.84539 4.473908 -0.173612
H  2.961565 3.962875 1.525693
H  4.240235 3.531014 0.37794
H  -1.403917 2.549509 0.467411
elementType: O N C H
totalener: -989.19794524 hartree
nucrepener: 1703.79935667 hartree
electener: -2692.99730190 hartree
oneelecener: -4730.43174530 hartree
twoeener: 2037.43444340 hartree
cpcmener: -0.03028133 hartree
kineticenergy: 985.02835662 hartree
xcener: -94.234373304842 hartree
chargesum: -0.0000000
charge: -0.537087 -0.311743 -0.550610 -0.038930 -0.233347 -0.138267 -0.478573 -0.099936 -0.053675 0.109952 -0.074639 0.059911 0.384594 0.421040 -0.204621 -0.170546 -0.283059 -0.159086 -0.148411 0.527906 -0.124823 0.072922 0.066887 0.098345 0.109611 0.065103 0.033308 0.199831 0.160392 0.158410 0.080086 0.081566 0.091888 0.161655 0.163077 0.113787 0.114728 0.126298 0.206056
qa: -0.5371 -0.3117 -0.5506 -0.0389 -0.2333 -0.1383 -0.4786 -0.0999 -0.0537 0.1100 -0.0746 0.0599 0.3846 0.4210 -0.2046 -0.1705 -0.2831 -0.1591 -0.1484 0.5279 -0.1248 0.0729 0.0669 0.0983 0.1096 0.0651 0.0333 0.1998 0.1604 0.1584 0.0801 0.0816 0.0919 0.1617 0.1631 0.1138 0.1147 0.1263 0.2061
va: 1.9689 2.0824 1.9359 3.2894 3.2233 3.4316 2.8687 3.8671 3.8745 3.7776 3.8651 3.8702 4.1138 4.2550 3.9901 3.9411 3.9526 3.9069 3.8890 4.2573 3.8737 1.0135 1.0113 1.0250 1.0000 1.0051 1.0282 1.0536 1.0258 0.9987 1.0008 1.0013 1.0031 0.9911 0.9884 0.9937 0.9932 0.9957 1.0242
dispcorr: -0.016460667 hartree
energy: -989.214405901988
dipole: 22.01166 -21.84653 0.16514 -7.42792 8.51528 1.08736 5.47089 -5.34873 0.12217
magnitude: 1.10659 au
magnitude: 2.81274 debye
