program: Orca
programVersion: 4.2.1
elementType: O O O N N N N C C C C C C C C C C C C C C H H H H H H H H H H H H H H H H H H
charge: 0
multiplicity: 1
keywords: wb97x-d3
keywords: def2-TZVPP
keywords: def2/J RIJCOSX GRIDX6 NOFINALGRIDX
keywords: grid4 nofinalgrid
keywords: scfconv7
keywords: smallprint printgap noloewdin
keywords: NOSOSCF
formula: C14H18N4O3
InChI: InChI=1S/C14H18N4O3/c1-3-4-9-15-13(19)18-11-8-6-5-7-10(11)16-12(18)17-14(20)21-2/h5-8,15-16H,3-4,9H2,1-2H3
39 atoms
O  -0.305882 -2.560612 -0.597224
O  2.495995 2.928744 -0.109475
O  0.394395 3.621523 0.221903
N  -0.674566 -0.33694 -0.326561
N  1.434179 -1.137742 -0.918149
N  -1.442452 1.662443 0.139441
N  0.913156 1.408403 -0.231508
C  3.452029 -2.174145 0.064987
C  2.470569 -2.134878 -1.099965
C  -2.06312 -0.45925 -0.145488
C  2.849939 -2.568436 1.409062
C  -2.531438 0.819212 0.146339
C  -0.31936 0.986346 -0.141629
C  0.17764 -1.442994 -0.616034
C  -2.947984 -1.525114 -0.216404
C  -3.864874 1.092684 0.380747
C  2.326703 -3.9966 1.457356
C  -4.291849 -1.257268 0.018185
C  -4.74738 0.024899 0.313078
C  1.184013 2.720035 -0.016977
C  2.957054 4.262903 0.081283
H  3.93094 -1.194544 0.152682
H  4.247557 -2.876944 -0.199407
H  2.006779 -3.10527 -1.262041
H  3.012283 -1.894279 -2.015586
H  3.619075 -2.443995 2.17525
H  2.050404 -1.872352 1.679853
H  1.712846 -0.164102 -0.80985
H  -2.629408 -2.528008 -0.442639
H  -4.199604 2.095936 0.605437
H  1.491158 -4.151633 0.774394
H  3.107979 -4.712039 1.192821
H  1.975516 -4.25083 2.458215
H  -4.998816 -2.074063 -0.031495
H  -5.800697 0.192421 0.491181
H  2.70169 4.642618 1.070606
H  4.038643 4.219734 -0.012171
H  2.562452 4.93907 -0.677332
H  -1.438773 2.657445 0.317432
elementType: O N C H
totalener: -989.19733794 hartree
nucrepener: 1709.99057892 hartree
electener: -2699.18791687 hartree
oneelecener: -4742.95192313 hartree
twoeener: 2043.76400626 hartree
cpcmener: -0.02948871 hartree
kineticenergy: 985.02897016 hartree
xcener: -94.235885717865 hartree
chargesum: -0.0000000
charge: -0.529965 -0.320012 -0.550343 -0.031059 -0.224423 -0.140193 -0.483034 -0.121034 -0.051311 0.109250 -0.106556 0.057747 0.389375 0.403688 -0.204268 -0.172025 -0.274886 -0.161671 -0.145353 0.526691 -0.125054 0.077982 0.072697 0.099824 0.111851 0.077786 0.057447 0.199157 0.161632 0.158853 0.075530 0.081192 0.092309 0.161414 0.162891 0.114122 0.127610 0.115263 0.206877
qa: -0.5300 -0.3200 -0.5503 -0.0311 -0.2244 -0.1402 -0.4830 -0.1210 -0.0513 0.1093 -0.1066 0.0577 0.3894 0.4037 -0.2043 -0.1720 -0.2749 -0.1617 -0.1454 0.5267 -0.1251 0.0780 0.0727 0.0998 0.1119 0.0778 0.0574 0.1992 0.1616 0.1589 0.0755 0.0812 0.0923 0.1614 0.1629 0.1141 0.1276 0.1153 0.2069
va: 1.9732 2.0738 1.9330 3.2899 3.2078 3.4310 2.8588 3.8810 3.8510 3.7800 3.8695 3.8691 4.1003 4.2539 3.9886 3.9442 3.9267 3.9071 3.8894 4.2650 3.8722 1.0150 1.0151 1.0155 1.0039 1.0071 1.0157 1.0552 1.0268 0.9986 1.0114 1.0021 1.0042 0.9912 0.9885 0.9938 0.9956 0.9933 1.0249
dispcorr: -0.016856576 hartree
energy: -989.214194520102
dipole: 16.47883 -16.38183 0.09700 -12.01027 13.08914 1.07887 5.19288 -5.05958 0.13330
magnitude: 1.09139 au
magnitude: 2.77410 debye
