program: Orca
programVersion: 4.2.1
elementType: O O O N N N N C C C C C C C C C C C C C C H H H H H H H H H H H H H H H H H H
charge: 0
multiplicity: 1
keywords: wb97x-d3
keywords: def2-TZVPP
keywords: def2/J RIJCOSX GRIDX6 NOFINALGRIDX
keywords: grid4 nofinalgrid
keywords: scfconv7
keywords: smallprint printgap noloewdin
keywords: NOSOSCF
formula: C14H18N4O3
InChI: InChI=1S/C14H18N4O3/c1-3-4-9-15-13(19)18-11-8-6-5-7-10(11)16-12(18)17-14(20)21-2/h5-8,15-16H,3-4,9H2,1-2H3
39 atoms
O  -0.548002 -2.530263 -0.278519
O  2.400719 2.899196 -0.062121
O  0.310608 3.675591 0.111021
N  -0.8566 -0.281057 -0.20113
N  1.274364 -1.189907 -0.456265
N  -1.586509 1.773781 0.021089
N  0.778747 1.420594 -0.134755
C  3.170328 -2.191612 0.744772
C  2.281793 -2.229366 -0.492895
C  -2.258468 -0.345311 -0.135629
C  4.3336 -3.176367 0.683262
C  -2.702804 0.968198 0.004038
C  -0.46901 1.042559 -0.103403
C  -0.023355 -1.433734 -0.311441
C  -3.173812 -1.386044 -0.192753
C  -4.040426 1.300476 0.096296
C  3.912194 -4.639151 0.674172
C  -4.521793 -1.058089 -0.101517
C  -4.95308 0.257638 0.041905
C  1.081901 2.738729 -0.017001
C  2.896589 4.2278 0.049865
H  2.561681 -2.389122 1.632381
H  3.568578 -1.179074 0.859732
H  1.787258 -3.193122 -0.596643
H  2.890059 -2.085928 -1.389813
H  4.94401 -2.963867 -0.199992
H  4.980879 -2.997379 1.545329
H  1.575534 -0.216817 -0.421672
H  -2.874074 -2.414121 -0.303273
H  -4.355948 2.329196 0.20563
H  4.782053 -5.296097 0.719774
H  3.279846 -4.873989 1.532917
H  3.357297 -4.907075 -0.226138
H  -5.252274 -1.854765 -0.143772
H  -6.011086 0.471535 0.111116
H  2.548102 4.862085 -0.766171
H  2.622106 4.6852 1.001279
H  3.979287 4.147129 -0.003675
H  -1.560497 2.780476 0.109996
elementType: O N C H
totalener: -989.20702240 hartree
nucrepener: 1675.13923697 hartree
electener: -2664.34625937 hartree
oneelecener: -4673.07212162 hartree
twoeener: 2008.72586225 hartree
cpcmener: -0.02501499 hartree
kineticenergy: 985.03168179 hartree
xcener: -94.234065895726 hartree
chargesum: -0.0000000
charge: -0.515111 -0.310471 -0.531024 -0.040132 -0.230407 -0.143245 -0.477744 -0.104929 -0.038438 0.109495 -0.108747 0.052586 0.382614 0.411675 -0.197646 -0.169053 -0.275246 -0.158385 -0.143137 0.512534 -0.125692 0.070912 0.072214 0.089464 0.104828 0.056917 0.071275 0.194777 0.161591 0.154253 0.092062 0.082197 0.078963 0.157433 0.158861 0.112938 0.113091 0.125730 0.202996
qa: -0.5151 -0.3105 -0.5310 -0.0401 -0.2304 -0.1432 -0.4777 -0.1049 -0.0384 0.1095 -0.1087 0.0526 0.3826 0.4117 -0.1976 -0.1691 -0.2752 -0.1584 -0.1431 0.5125 -0.1257 0.0709 0.0722 0.0895 0.1048 0.0569 0.0713 0.1948 0.1616 0.1543 0.0921 0.0822 0.0790 0.1574 0.1589 0.1129 0.1131 0.1257 0.2030
va: 2.0003 2.0821 1.9572 3.2931 3.2309 3.4251 2.8663 3.8855 3.8255 3.7869 3.8986 3.8749 4.1112 4.2580 3.9936 3.9502 3.9321 3.9104 3.8974 4.2827 3.8787 1.0105 1.0207 1.0303 0.9986 1.0089 1.0062 1.0567 1.0266 0.9998 1.0037 0.9996 0.9996 0.9926 0.9899 0.9937 0.9937 0.9954 1.0287
dispcorr: -0.015517824 hartree
energy: -989.222540225279
dipole: 21.52877 -21.34960 0.17917 -14.23770 15.27798 1.04028 3.40294 -3.34708 0.05586
magnitude: 1.05708 au
magnitude: 2.68688 debye
