program: Gaussian 09
title: 000038003
version: EM64L-G09RevD.01
frameworkgroup: C1[X(C14H11ClN4O4)]
method: RPBEPBE
basis: SDD
operation: Freq
keyword: #p
keyword: freq=noraman
keyword: PBEPBE/SDD
title: #p freq=noraman PBEPBE/SDD
converged: YES YES NO NO
title: Mulliken charges:
elementType: Cl O O O O N N N N C C C C C C C C C C C C C C H H H H H H H H H H H
charge: -0.033316 -0.180628 -0.256859 -0.207357 -0.201714 -0.423622 -0.035502 0.025542 0.017148 0.307562 0.257910 0.320619 -0.283514 0.184060 -0.495221 0.447953 -0.367692 -0.358841 -0.351020 -0.789291 -0.236252 -0.224967 -0.226122 0.294822 0.337098 0.294331 0.384311 0.245676 0.255780 0.299202 0.292925 0.234970 0.234504 0.237502
chargesum: 0.00000
title: Mulliken charges with hydrogens summed into heavy atoms:
elementType: Cl O O O O N N N N C C C C C C C C C C C C C C
charge: -0.033316 -0.180628 -0.256859 -0.207357 -0.201714 -0.039311 -0.035502 0.025542 0.017148 0.307562 0.257910 0.320619 0.011308 0.184060 -0.158123 0.447953 -0.073362 -0.113165 -0.095240 -0.197164 -0.001282 0.009537 0.011380
polarizability: 4.94031920e+02 1.16438183e+01 2.60857757e+02 -2.10502923e+00 -2.57399626e+00 9.29135163e+01
1716.lowfreq: -3.6896 -0.0008 -0.0008 0.0015 3.5308 5.2253 18.3668 33.1788 40.9488
frequency: 17.8198 33.1635 40.9440 42.9670 51.4906 58.8436 75.6509 90.0044 127.9891 153.8763 161.6330 168.8709 193.8826 230.6765 284.4321 304.6412 323.2350 347.5543 366.5422 385.4073 401.5886 409.1725 437.1236 453.5642 495.2919 515.7336 517.9672 551.3086 603.1093 615.0851 616.6805 650.6175 653.1071 678.2412 692.8133 696.6292 707.2022 725.7319 754.8191 757.7773 784.0622 815.2259 840.2545 849.0190 862.5641 889.2896 929.5982 936.0236 964.3611 980.6083 988.2321 1001.9825 1003.6269 1009.9191 1032.9030 1050.9888 1085.6470 1101.8747 1106.8200 1130.2647 1138.5894 1169.6891 1176.2187 1195.2325 1211.4184 1232.0794 1248.4578 1298.6601 1310.3521 1323.7466 1344.2465 1362.9401 1382.8945 1390.3552 1434.2619 1444.9255 1471.1255 1482.5101 1488.7971 1516.7880 1522.7456 1582.4778 1586.8206 1609.7277 1620.4322 3060.5623 3131.8169 3138.8595 3150.8714 3157.0644 3163.0531 3173.6786 3180.4418 3188.9509 3202.0533 3203.6931
redmass: 9.1010 7.5799 11.2711 6.6098 5.2837 14.2690 11.5192 7.5818 7.4514 9.1797 6.0484 7.6001 7.4837 7.0295 5.4715 7.1072 5.1312 4.7134 12.1206 5.2649 2.8546 6.7354 4.6785 5.6796 6.4500 3.6960 4.7524 6.1331 5.5585 6.4876 6.0223 7.4008 6.4948 9.9145 2.5124 2.4802 7.4654 4.9557 11.5308 3.6148 2.3082 1.2917 3.0144 1.3280 1.4333 5.8318 1.4624 2.3455 1.4090 1.5335 4.1950 1.4136 2.8516 1.3256 1.9760 2.0494 1.8164 4.1168 2.6659 1.3305 1.3731 8.4635 1.0565 1.1240 6.6040 1.7261 1.1758 2.2231 2.5682 1.6081 4.9867 7.2004 7.3297 5.0027 2.3701 5.8640 1.8764 2.2930 2.0149 3.3698 3.4202 5.5078 4.5978 5.9166 7.3788 1.0635 1.0853 1.0884 1.0937 1.1034 1.0960 1.1006 1.0898 1.0920 1.0950 1.0801
irintensity: 0.1901 0.8031 0.9905 0.3672 0.4881 0.2245 0.4227 3.0156 3.1939 2.1345 2.5468 3.2063 1.3114 2.6318 1.3645 0.5898 1.0662 5.4471 1.2570 7.6041 1.9774 10.1182 1.9035 5.1205 2.1673 16.0288 10.2394 23.8019 30.3414 0.2906 6.0130 13.6394 9.9821 8.4630 25.4360 35.0176 8.1729 3.1914 21.4506 9.9085 44.3471 103.7427 22.5253 2.9181 27.3459 3.7852 13.1760 45.0839 24.6363 2.0504 0.0842 2.4679 42.6089 0.4751 3.6370 26.8954 21.4749 53.9983 42.0313 13.0977 72.3978 337.6860 0.8650 9.8829 570.7917 139.9847 10.4958 43.5133 10.6464 16.7262 349.3375 49.1512 0.4152 74.3478 12.8161 0.9343 46.1921 25.4305 154.8874 70.1997 5.4071 40.0226 127.0828 18.8238 451.6643 11.3928 2.9807 1.5492 17.9201 2.6759 25.8152 24.8749 3.3460 20.5807 2.0179 73.5153
temp: 298.150 k
press: 1.00000 atm
elementType: 17 8 8 8 8 7 7 7 7 6 6 6 6 6 6 6 6 6 6 6 6 6 6 1 1 1 1 1 1 1 1 1 1 1
symmnumber: 1
zpe: 622375.1 jmol-1
zpe.correction: 0.237050 hartree
zpe.thermalcorrener: 0.257052 hartree
zpe.thermalcorrenthalpy: 0.257996 hartree
zpe.thermalcorrgfe: 0.184956 hartree
zpe.sumelectzpe: -1518.239533 hartree
zpe.sumelectthermal: -1518.219532 hartree
zpe.sumelectthermalent: -1518.218588 hartree
zpe.sumelectthermalfe: -1518.291627 hartree
dipole: -8.3467 -2.3422 -1.5554
dipole: 8.8075
quadrupole: -157.5959 -149.8002 -140.4057
quadrupole: 8.8903 1.9946 -0.3016
quadrupole: -8.3286 -0.5330 8.8616 8.8903 1.9946 -0.3016
hfenergy: -1518.4765835 hartree
pointgroup: C01 [X(C14H11Cl1N4O4)]
dipole: -3.3276776 0.7498542 0.6094615 debye
polarizability: 494.4584554|-2.2617325|260.0364161|7.6687778|7.0036986|93.3083225 unknown
InChI: InChI=1S/C14H11ClN4O4/c15-9-13(10-4-2-1-3-5-10)17-16-12-7-6-11(18(20)21)8-14(12)19(22)23/h1-8,16H,9H2
charge 0 multiplicity 1
34 atoms
Cl -2.379719 -3.028683 -1.258221
O  3.463194 -3.052174 0.29779
O  1.186645 -3.038682 0.245439
O  5.032041 3.002749 -0.208969
O  6.05992 0.964889 -0.082402
N  -0.106148 -0.783435 0.122788
N  -1.24018 -0.001899 0.099357
N  2.346872 -2.419383 0.22136
N  5.006951 1.71222 -0.119964
C  1.138243 -0.182475 0.063837
C  2.354661 -0.958941 0.104779
C  -3.624468 0.264512 0.124684
C  1.260254 1.240594 -0.039164
C  -2.424153 -0.604001 0.198991
C  3.619998 -0.335793 0.045052
C  3.685606 1.058174 -0.056784
C  2.508197 1.855843 -0.10078
C  -4.893679 -0.27102 -0.234178
C  -3.523058 1.659459 0.397575
C  -2.587529 -2.089198 0.394923
C  -6.027807 0.564674 -0.313763
C  -4.657629 2.488736 0.321924
C  -5.917057 1.945505 -0.033019
H  0.337701 1.821993 -0.076872
H  4.529629 -0.940697 0.079994
H  2.606265 2.941293 -0.184841
H  -0.090223 -1.825557 0.124877
H  -4.996517 -1.330907 -0.49081
H  -2.548665 2.071417 0.676224
H  -3.585899 -2.359179 0.757017
H  -1.824913 -2.528203 1.057544
H  -6.994964 0.139486 -0.602345
H  -4.565913 3.557383 0.544255
H  -6.799754 2.591598 -0.089698
