program: Orca
programVersion: 4.2.1
elementType: O O O N N N N C C C C C C C C C C C C C C H H H H H H H H H H H H H H H H H H
charge: 0
multiplicity: 1
keywords: wb97x-d3
keywords: def2-TZVPP
keywords: def2/J RIJCOSX GRIDX6 NOFINALGRIDX
keywords: grid4 nofinalgrid
keywords: scfconv7
keywords: smallprint printgap noloewdin
keywords: NOSOSCF
formula: C14H18N4O3
InChI: InChI=1S/C14H18N4O3/c1-3-4-9-15-13(19)18-11-8-6-5-7-10(11)16-12(18)17-14(20)21-2/h5-8,15-16H,3-4,9H2,1-2H3
39 atoms
O  -0.565086 -2.601419 0.783286
O  2.500899 2.738708 0.275643
O  0.477719 3.489841 -0.310979
N  -0.813872 -0.38259 0.35858
N  1.249176 -1.267591 1.001528
N  -1.458119 1.62337 -0.243139
N  0.853964 1.286019 0.294694
C  2.704354 -3.023969 0.012395
C  2.185556 -2.340404 1.272301
C  -2.192949 -0.451846 0.102649
C  3.449247 -2.085859 -0.928323
C  -2.58336 0.830344 -0.278291
C  -0.385316 0.912867 0.13724
C  -0.028015 -1.511949 0.72854
C  -3.127896 -1.474148 0.1685
C  -3.886324 1.147087 -0.609998
C  3.948615 -2.789716 -2.180957
C  -4.441257 -1.161338 -0.163183
C  -4.818804 0.12207 -0.547586
C  1.200143 2.576823 0.053468
C  3.03416 4.042684 0.07698
H  1.871129 -3.498583 -0.514272
H  3.369739 -3.834552 0.324889
H  3.015282 -1.898876 1.825472
H  1.719973 -3.070815 1.934458
H  2.797926 -1.256313 -1.218904
H  4.29565 -1.637833 -0.398024
H  1.590558 -0.318387 0.866085
H  -2.867562 -2.476649 0.462405
H  -4.161398 2.150699 -0.904922
H  4.633178 -3.604377 -1.936041
H  3.122034 -3.216396 -2.752777
H  4.480889 -2.101775 -2.839516
H  -5.186702 -1.943985 -0.119664
H  -5.850742 0.324745 -0.8006
H  2.578587 4.774276 0.745691
H  4.094497 3.969086 0.304941
H  2.916296 4.377839 -0.954307
H  -1.399206 2.60671 -0.468383
elementType: O N C H
totalener: -989.20856384 hartree
nucrepener: 1699.37551435 hartree
electener: -2688.58407819 hartree
oneelecener: -4721.55589780 hartree
twoeener: 2032.97181961 hartree
cpcmener: -0.02495625 hartree
kineticenergy: 985.03524303 hartree
xcener: -94.233752532322 hartree
chargesum: -0.0000000
charge: -0.513054 -0.311471 -0.530266 -0.035107 -0.243404 -0.143501 -0.477045 -0.105768 -0.057475 0.108170 -0.085428 0.054548 0.384694 0.413369 -0.199430 -0.168879 -0.280056 -0.156779 -0.143585 0.512713 -0.125954 0.067470 0.075341 0.106852 0.101796 0.049448 0.061029 0.204766 0.161806 0.154773 0.079651 0.080055 0.090493 0.157361 0.159451 0.113140 0.125492 0.113099 0.201682
qa: -0.5131 -0.3115 -0.5303 -0.0351 -0.2434 -0.1435 -0.4770 -0.1058 -0.0575 0.1082 -0.0854 0.0545 0.3847 0.4134 -0.1994 -0.1689 -0.2801 -0.1568 -0.1436 0.5127 -0.1260 0.0675 0.0753 0.1069 0.1018 0.0494 0.0610 0.2048 0.1618 0.1548 0.0797 0.0801 0.0905 0.1574 0.1595 0.1131 0.1255 0.1131 0.2017
va: 1.9995 2.0820 1.9586 3.2922 3.2018 3.4291 2.8581 3.8115 3.8850 3.7861 3.8580 3.8749 4.1043 4.2640 3.9916 3.9481 3.9533 3.9104 3.8976 4.2819 3.8791 1.0191 1.0146 1.0012 1.0164 1.0240 1.0065 1.0514 1.0267 0.9996 1.0007 1.0007 1.0031 0.9925 0.9896 0.9936 0.9957 0.9935 1.0292
dispcorr: -0.016179269 hartree
energy: -989.224743109486
dipole: 19.86743 -19.73906 0.12836 -10.07498 11.08964 1.01466 -5.98807 5.77312 -0.21495
magnitude: 1.04509 au
magnitude: 2.65641 debye
