program: Orca
programVersion: 4.2.1
elementType: O O O N N N N C C C C C C C C C C C C C C H H H H H H H H H H H H H H H H H H
charge: 0
multiplicity: 1
keywords: wb97x-d3
keywords: def2-TZVPP
keywords: def2/J RIJCOSX GRIDX6 NOFINALGRIDX
keywords: grid4 nofinalgrid
keywords: scfconv7
keywords: smallprint printgap noloewdin
keywords: NOSOSCF
formula: C14H18N4O3
InChI: InChI=1S/C14H18N4O3/c1-3-4-9-15-13(19)18-11-8-6-5-7-10(11)16-12(18)17-14(20)21-2/h5-8,15-16H,3-4,9H2,1-2H3
39 atoms
O  -0.744445 -2.559418 0.408041
O  2.416193 2.748716 0.213423
O  0.387445 3.581014 -0.226447
N  -0.958587 -0.308996 0.185856
N  1.099046 -1.270453 0.708617
N  -1.582656 1.752198 -0.219365
N  0.739224 1.331643 0.198474
C  3.087451 -2.386383 -0.216486
C  2.056899 -2.338343 0.903538
C  -2.348022 -0.331011 -0.019668
C  4.133911 -3.470124 0.005319
C  -2.725228 0.985991 -0.274683
C  -0.512371 0.993019 0.058634
C  -0.18468 -1.480416 0.439735
C  -3.302964 -1.33697 -0.00103
C  -4.033211 1.355109 -0.5219
C  5.18391 -3.499798 -1.094906
C  -4.621481 -0.971709 -0.248049
C  -4.98561 0.346938 -0.50556
C  1.103852 2.629336 0.037917
C  2.972548 4.050932 0.077281
H  3.582427 -1.412639 -0.293812
H  2.576101 -2.55295 -1.169357
H  2.556587 -2.181344 1.86264
H  1.525509 -3.285921 0.975544
H  4.623772 -3.313121 0.971196
H  3.642142 -4.44552 0.068267
H  1.438339 -0.310706 0.656324
H  -3.053876 -2.365998 0.194627
H  -4.297003 2.385622 -0.717637
H  4.732898 -3.686177 -2.071539
H  5.720632 -2.550993 -1.157039
H  5.923023 -4.283019 -0.92054
H  -5.382252 -1.740686 -0.239032
H  -6.022404 0.590651 -0.694527
H  2.821084 4.455007 -0.924531
H  2.563299 4.747101 0.810421
H  4.039263 3.939204 0.254493
H  -1.509007 2.750207 -0.361394
elementType: O N C H
totalener: -989.20822115 hartree
nucrepener: 1670.28666456 hartree
electener: -2659.49488571 hartree
oneelecener: -4663.32885169 hartree
twoeener: 2003.83396598 hartree
cpcmener: -0.02500794 hartree
kineticenergy: 985.03505113 hartree
xcener: -94.233886431749 hartree
chargesum: 0.0000000
charge: -0.514650 -0.310512 -0.530806 -0.040928 -0.228469 -0.142369 -0.478755 -0.091637 -0.038163 0.109604 -0.094597 0.052612 0.382371 0.412837 -0.199047 -0.169202 -0.275669 -0.156691 -0.144136 0.513248 -0.125976 0.062346 0.067017 0.101067 0.090218 0.056931 0.062146 0.194828 0.161296 0.154747 0.079165 0.078768 0.091590 0.157315 0.159378 0.113202 0.112848 0.125568 0.202504
qa: -0.5146 -0.3105 -0.5308 -0.0409 -0.2285 -0.1424 -0.4788 -0.0916 -0.0382 0.1096 -0.0946 0.0526 0.3824 0.4128 -0.1990 -0.1692 -0.2757 -0.1567 -0.1441 0.5132 -0.1260 0.0623 0.0670 0.1011 0.0902 0.0569 0.0621 0.1948 0.1613 0.1547 0.0792 0.0788 0.0916 0.1573 0.1594 0.1132 0.1128 0.1256 0.2025
va: 2.0004 2.0820 1.9574 3.2923 3.2274 3.4247 2.8659 3.8772 3.8444 3.7852 3.8873 3.8773 4.1130 4.2587 3.9921 3.9497 3.9457 3.9086 3.8971 4.2818 3.8790 1.0163 1.0121 1.0009 1.0293 1.0083 1.0063 1.0566 1.0266 0.9996 1.0009 1.0008 1.0036 0.9924 0.9895 0.9936 0.9936 0.9957 1.0289
dispcorr: -0.015215923 hartree
energy: -989.223437069784
dipole: 24.01141 -23.82039 0.19102 -12.52481 13.52828 1.00346 -2.54245 2.48092 -0.06153
magnitude: 1.02334 au
magnitude: 2.60111 debye
