program: Orca
programVersion: 4.2.1
elementType: O O O N N N N C C C C C C C C C C C C C C H H H H H H H H H H H H H H H H H H
charge: 0
multiplicity: 1
keywords: wb97x-d3
keywords: def2-TZVPP
keywords: def2/J RIJCOSX GRIDX6 NOFINALGRIDX
keywords: grid4 nofinalgrid
keywords: scfconv7
keywords: smallprint printgap noloewdin
keywords: NOSOSCF
formula: C14H18N4O3
InChI: InChI=1S/C14H18N4O3/c1-3-4-9-15-13(19)18-11-8-6-5-7-10(11)16-12(18)17-14(20)21-2/h5-8,15-16H,3-4,9H2,1-2H3
39 atoms
O  -0.721093 -2.547582 0.441844
O  2.412351 2.775292 0.198769
O  0.377641 3.594998 -0.236943
N  -0.946087 -0.300772 0.195942
N  1.116279 -1.247451 0.728145
N  -1.581159 1.754245 -0.226262
N  0.74317 1.348704 0.193518
C  3.058247 -2.422061 -0.229729
C  2.07831 -2.310206 0.930927
C  -2.335231 -0.331947 -0.01116
C  4.113302 -3.495122 0.003749
C  -2.719224 0.981105 -0.277081
C  -0.506909 1.002954 0.057425
C  -0.166768 -1.465552 0.461852
C  -3.285616 -1.342158 0.013215
C  -4.028292 1.342145 -0.530042
C  5.107348 -3.593856 -1.143403
C  -4.605278 -0.985108 -0.23975
C  -4.975693 0.329559 -0.508399
C  1.100323 2.647837 0.026653
C  2.961762 4.079782 0.057745
H  3.549509 -1.45516 -0.38072
H  2.505024 -2.63833 -1.148644
H  2.620459 -2.10553 1.857225
H  1.547264 -3.249855 1.076313
H  4.650907 -3.282857 0.932978
H  3.624659 -4.463361 0.148507
H  1.452977 -0.287961 0.663468
H  -3.033444 -2.368722 0.217255
H  -4.296203 2.369732 -0.734806
H  5.855742 -4.365426 -0.95739
H  4.608711 -3.840172 -2.082809
H  5.638177 -2.651224 -1.290763
H  -5.362094 -1.75785 -0.22658
H  -6.013126 0.566593 -0.702024
H  2.803012 4.481187 -0.943959
H  2.552457 4.775083 0.791613
H  4.029741 3.973113 0.229897
H  -1.513467 2.751474 -0.376488
elementType: O N C H
totalener: -989.20835994 hartree
nucrepener: 1670.14668303 hartree
electener: -2659.35504297 hartree
oneelecener: -4663.05481138 hartree
twoeener: 2003.69976840 hartree
cpcmener: -0.02508826 hartree
kineticenergy: 985.03396119 hartree
xcener: -94.233638479283 hartree
chargesum: -0.0000000
charge: -0.514588 -0.311233 -0.530786 -0.040490 -0.229678 -0.142350 -0.478703 -0.092307 -0.039571 0.109221 -0.094457 0.053164 0.382274 0.412655 -0.198931 -0.169586 -0.276129 -0.156798 -0.143579 0.513332 -0.125903 0.062580 0.067401 0.102291 0.090091 0.057460 0.062046 0.195858 0.161411 0.154293 0.091674 0.079402 0.078848 0.157338 0.159373 0.113187 0.112993 0.125636 0.202560
qa: -0.5146 -0.3112 -0.5308 -0.0405 -0.2297 -0.1423 -0.4787 -0.0923 -0.0396 0.1092 -0.0945 0.0532 0.3823 0.4127 -0.1989 -0.1696 -0.2761 -0.1568 -0.1436 0.5133 -0.1259 0.0626 0.0674 0.1023 0.0901 0.0575 0.0620 0.1959 0.1614 0.1543 0.0917 0.0794 0.0788 0.1573 0.1594 0.1132 0.1130 0.1256 0.2026
va: 1.9997 2.0811 1.9573 3.2923 3.2270 3.4249 2.8653 3.8739 3.8451 3.7858 3.8867 3.8759 4.1131 4.2594 3.9925 3.9495 3.9452 3.9086 3.8966 4.2819 3.8788 1.0166 1.0121 1.0010 1.0286 1.0081 1.0063 1.0560 1.0265 0.9998 1.0035 1.0010 1.0008 0.9924 0.9895 0.9936 0.9936 0.9957 1.0289
dispcorr: -0.015222669 hartree
energy: -989.223582609315
dipole: 23.76523 -23.58102 0.18421 -12.79052 13.79462 1.00410 -2.69549 2.61359 -0.08190
magnitude: 1.02414 au
magnitude: 2.60315 debye
