program: Orca
programVersion: 4.2.1
elementType: O O O N N N N C C C C C C C C C C C C C C H H H H H H H H H H H H H H H H H H
charge: 0
multiplicity: 1
keywords: wb97x-d3
keywords: def2-TZVPP
keywords: def2/J RIJCOSX GRIDX6 NOFINALGRIDX
keywords: grid4 nofinalgrid
keywords: scfconv7
keywords: smallprint printgap noloewdin
keywords: NOSOSCF
formula: C14H18N4O3
InChI: InChI=1S/C14H18N4O3/c1-3-4-9-15-13(19)18-11-8-6-5-7-10(11)16-12(18)17-14(20)21-2/h5-8,15-16H,3-4,9H2,1-2H3
39 atoms
O  -0.903012 -2.755292 -0.538872
O  2.566695 2.278413 0.264239
O  0.567746 3.253437 0.503774
N  -0.9952 -0.498284 -0.289997
N  1.040941 -1.584908 -0.60121
N  -1.523595 1.585482 0.139024
N  0.79839 1.010568 -0.024323
C  3.066183 -2.639873 0.313725
C  1.946676 -2.710201 -0.715665
C  -2.397171 -0.426773 -0.25435
C  3.998195 -1.44454 0.146682
C  -2.713532 0.902989 0.017607
C  -0.481345 0.761764 -0.04786
C  -0.275151 -1.715325 -0.485318
C  -3.406693 -1.35913 -0.44231
C  -4.014957 1.355339 0.119035
C  5.119739 -1.434255 1.174006
C  -4.718318 -0.909598 -0.342741
C  -5.022579 0.420331 -0.065898
C  1.237433 2.262012 0.264475
C  3.202682 3.514599 0.564577
H  3.649104 -3.561789 0.229109
H  2.631212 -2.639328 1.317988
H  1.381111 -3.631285 -0.588511
H  2.369186 -2.732872 -1.724618
H  4.42413 -1.457849 -0.861344
H  3.441823 -0.50579 0.23035
H  1.421427 -0.644471 -0.5039
H  -3.203264 -2.394193 -0.657965
H  -4.233779 2.393026 0.331073
H  5.781227 -0.57875 1.030611
H  4.725924 -1.376631 2.190634
H  5.730251 -2.336934 1.108373
H  -5.521775 -1.619601 -0.486023
H  -6.056219 0.731032 0.004627
H  4.270884 3.317057 0.524214
H  2.957417 4.286276 -0.166168
H  2.946288 3.871874 1.562703
H  -1.400618 2.569327 0.336211
elementType: O N C H
totalener: -989.20698939 hartree
nucrepener: 1701.99629520 hartree
electener: -2691.20328458 hartree
oneelecener: -4726.75271731 hartree
twoeener: 2035.54943273 hartree
cpcmener: -0.02424407 hartree
kineticenergy: 985.03237048 hartree
xcener: -94.234569715497 hartree
chargesum: -0.0000000
charge: -0.513684 -0.294556 -0.531934 -0.041830 -0.228745 -0.142452 -0.476073 -0.107499 -0.050287 0.110083 -0.062487 0.053854 0.377202 0.414459 -0.199510 -0.167353 -0.282470 -0.155802 -0.145839 0.513914 -0.122873 0.067750 0.067573 0.099368 0.103921 0.063102 0.025677 0.194799 0.160460 0.154371 0.090826 0.080040 0.081776 0.157838 0.158865 0.119997 0.111858 0.113019 0.202641
qa: -0.5137 -0.2946 -0.5319 -0.0418 -0.2287 -0.1425 -0.4761 -0.1075 -0.0503 0.1101 -0.0625 0.0539 0.3772 0.4145 -0.1995 -0.1674 -0.2825 -0.1558 -0.1458 0.5139 -0.1229 0.0677 0.0676 0.0994 0.1039 0.0631 0.0257 0.1948 0.1605 0.1544 0.0908 0.0800 0.0818 0.1578 0.1589 0.1200 0.1119 0.1130 0.2026
va: 2.0038 2.0964 1.9587 3.2894 3.2230 3.4268 2.8805 3.8969 3.8641 3.7844 3.8551 3.8776 4.1254 4.2627 3.9935 3.9489 3.9528 3.9089 3.8981 4.2714 3.8821 1.0133 1.0122 1.0272 0.9985 1.0076 1.0343 1.0537 1.0269 0.9998 1.0033 1.0009 1.0019 0.9925 0.9899 0.9959 0.9935 0.9935 1.0282
dispcorr: -0.016458064 hartree
energy: -989.223447449860
dipole: 23.88688 -23.63033 0.25655 -6.11830 7.15364 1.03534 3.65708 -3.56254 0.09454
magnitude: 1.07083 au
magnitude: 2.72184 debye
