program: Orca
programVersion: 4.2.1
elementType: O O O N N N N C C C C C C C C C C C C C C H H H H H H H H H H H H H H H H H H
charge: 0
multiplicity: 1
keywords: wb97x-d3
keywords: def2-TZVPP
keywords: def2/J RIJCOSX GRIDX6 NOFINALGRIDX
keywords: grid4 nofinalgrid
keywords: scfconv7
keywords: smallprint printgap noloewdin
keywords: NOSOSCF
formula: C14H18N4O3
InChI: InChI=1S/C14H18N4O3/c1-3-4-9-15-13(19)18-11-8-6-5-7-10(11)16-12(18)17-14(20)21-2/h5-8,15-16H,3-4,9H2,1-2H3
39 atoms
O  -0.811004 -2.783014 -0.312365
O  2.596496 2.318932 0.168079
O  0.589436 3.284205 0.383601
N  -0.937205 -0.515778 -0.230392
N  1.108042 -1.588472 -0.529373
N  -1.489889 1.577725 0.108816
N  0.83869 1.02351 -0.048568
C  2.922433 -2.755223 0.672467
C  2.03161 -2.703629 -0.562999
C  -2.339235 -0.461345 -0.18707
C  3.772174 -1.507487 0.904969
C  -2.671748 0.874844 0.027216
C  -0.43786 0.760119 -0.049757
C  -0.20109 -1.732096 -0.355151
C  -3.336117 -1.414601 -0.330589
C  -3.978855 1.313078 0.116773
C  4.725225 -1.182463 -0.236564
C  -4.653482 -0.979317 -0.243242
C  -4.974406 0.356929 -0.021152
C  1.267877 2.290055 0.183023
C  3.22128 3.574176 0.406329
H  3.577357 -3.6259 0.570052
H  2.298358 -2.93968 1.551324
H  1.467107 -3.629467 -0.652742
H  2.63552 -2.621894 -1.469261
H  3.129878 -0.642948 1.099791
H  4.348514 -1.65459 1.821836
H  1.476577 -0.639027 -0.479276
H  -3.118736 -2.455092 -0.503158
H  -4.211287 2.355972 0.284821
H  5.367539 -0.338589 0.019303
H  5.374208 -2.029946 -0.468522
H  4.199841 -0.911723 -1.15444
H  -5.447791 -1.705601 -0.351946
H  -6.011935 0.656191 0.042125
H  4.291389 3.388066 0.359346
H  2.957181 4.311753 -0.352661
H  2.974633 3.97093 1.392069
H  -1.378494 2.571126 0.259114
elementType: O N C H
totalener: -989.20588910 hartree
nucrepener: 1714.79392394 hartree
electener: -2703.99981304 hartree
oneelecener: -4752.36746853 hartree
twoeener: 2048.36765548 hartree
cpcmener: -0.02404643 hartree
kineticenergy: 985.03192000 hartree
xcener: -94.235191794681 hartree
chargesum: -0.0000000
charge: -0.511486 -0.296011 -0.531918 -0.041665 -0.221808 -0.142476 -0.473633 -0.107401 -0.087321 0.109202 -0.108989 0.054960 0.377736 0.410622 -0.198350 -0.168086 -0.270344 -0.156276 -0.145312 0.512575 -0.124373 0.071455 0.076040 0.101681 0.120043 0.044797 0.074342 0.197724 0.160130 0.154305 0.092123 0.088492 0.074021 0.157570 0.158848 0.121286 0.112325 0.112736 0.202435
qa: -0.5115 -0.2960 -0.5319 -0.0417 -0.2218 -0.1425 -0.4736 -0.1074 -0.0873 0.1092 -0.1090 0.0550 0.3777 0.4106 -0.1984 -0.1681 -0.2703 -0.1563 -0.1453 0.5126 -0.1244 0.0715 0.0760 0.1017 0.1200 0.0448 0.0743 0.1977 0.1601 0.1543 0.0921 0.0885 0.0740 0.1576 0.1588 0.1213 0.1123 0.1127 0.2024
va: 2.0044 2.0944 1.9591 3.2886 3.2060 3.4272 2.8782 3.8845 3.8577 3.7857 3.8634 3.8757 4.1204 4.2710 3.9944 3.9489 3.9316 3.9107 3.8976 4.2724 3.8824 1.0136 1.0127 1.0304 0.9893 1.0309 1.0126 1.0517 1.0266 0.9999 1.0057 1.0017 1.0016 0.9926 0.9899 0.9954 0.9937 0.9933 1.0280
dispcorr: -0.017213898 hartree
energy: -989.223103001342
dipole: 22.51141 -22.27931 0.23211 -5.71849 6.75943 1.04094 1.85113 -1.79234 0.05880
magnitude: 1.06813 au
magnitude: 2.71496 debye
