program: Orca
programVersion: 4.2.1
elementType: O O O N N N N C C C C C C C C C C C C C C H H H H H H H H H H H H H H H H H H
charge: 0
multiplicity: 1
keywords: wb97x-d3
keywords: def2-TZVPP
keywords: def2/J RIJCOSX GRIDX6 NOFINALGRIDX
keywords: grid4 nofinalgrid
keywords: scfconv7
keywords: smallprint printgap noloewdin
keywords: NOSOSCF
formula: C14H18N4O3
InChI: InChI=1S/C14H18N4O3/c1-3-4-9-15-13(19)18-11-8-6-5-7-10(11)16-12(18)17-14(20)21-2/h5-8,15-16H,3-4,9H2,1-2H3
39 atoms
O  -0.71344 -2.663776 -0.837153
O  2.55902 2.470314 0.100422
O  0.542119 3.319937 0.566422
N  -0.90063 -0.436626 -0.419174
N  1.158218 -1.388641 -0.948209
N  -1.495495 1.575875 0.212354
N  0.833998 1.138603 -0.154019
C  3.368327 -2.226549 -0.329468
C  2.113486 -2.457453 -1.159592
C  -2.297439 -0.444306 -0.280136
C  3.121126 -2.231066 1.173838
C  -2.656983 0.841203 0.1198
C  -0.430426 0.826058 -0.110467
C  -0.137988 -1.595981 -0.75153
C  -3.270374 -1.414218 -0.469691
C  -3.967824 1.211568 0.349953
C  4.388335 -1.97256 1.974027
C  -4.591413 -1.047181 -0.240386
C  -4.93905 0.238751 0.163633
C  1.235878 2.385421 0.201273
C  3.158383 3.712127 0.448962
H  3.832528 -1.279813 -0.627331
H  4.087504 -3.008362 -0.588855
H  1.653678 -3.408933 -0.893836
H  2.37473 -2.514661 -2.2196
H  2.376115 -1.472901 1.430436
H  2.689642 -3.193341 1.466131
H  1.505962 -0.440571 -0.804535
H  -3.031775 -2.41708 -0.78078
H  -4.221121 2.216408 0.659897
H  5.152391 -2.725819 1.771634
H  4.816492 -0.99738 1.73287
H  4.190932 -1.9859 3.046935
H  -5.36711 -1.787866 -0.381515
H  -5.978536 0.484824 0.333793
H  2.97006 3.976723 1.490296
H  4.227959 3.576824 0.308206
H  2.817549 4.524457 -0.194237
H  -1.410994 2.546306 0.481525
elementType: O N C H
totalener: -989.20706572 hartree
nucrepener: 1704.21885437 hartree
electener: -2693.42592009 hartree
oneelecener: -4731.19847978 hartree
twoeener: 2037.77255969 hartree
cpcmener: -0.02482946 hartree
kineticenergy: 985.03599444 hartree
xcener: -94.234437663624 hartree
chargesum: 0.0000000
charge: -0.513006 -0.307308 -0.530676 -0.039510 -0.233109 -0.141869 -0.472715 -0.109518 -0.050357 0.107858 -0.084765 0.057031 0.382179 0.417282 -0.199007 -0.169524 -0.276418 -0.156594 -0.145262 0.510623 -0.125957 0.065463 0.074169 0.097675 0.103785 0.052599 0.063159 0.189925 0.160992 0.154103 0.080027 0.077611 0.091600 0.157738 0.159118 0.112705 0.125114 0.112762 0.202081
qa: -0.5130 -0.3073 -0.5307 -0.0395 -0.2331 -0.1419 -0.4727 -0.1095 -0.0504 0.1079 -0.0848 0.0570 0.3822 0.4173 -0.1990 -0.1695 -0.2764 -0.1566 -0.1453 0.5106 -0.1260 0.0655 0.0742 0.0977 0.1038 0.0526 0.0632 0.1899 0.1610 0.1541 0.0800 0.0776 0.0916 0.1577 0.1591 0.1127 0.1251 0.1128 0.2021
va: 2.0030 2.0843 1.9586 3.2894 3.2103 3.4294 2.8666 3.8735 3.8758 3.7871 3.8526 3.8727 4.1063 4.2522 3.9931 3.9487 3.9468 3.9109 3.8967 4.2845 3.8788 1.0111 1.0144 1.0213 1.0012 1.0243 1.0087 1.0647 1.0267 1.0000 1.0004 1.0023 1.0030 0.9925 0.9897 0.9936 0.9956 0.9937 1.0278
dispcorr: -0.016338233 hartree
energy: -989.223403952130
dipole: 21.52181 -21.32472 0.19710 -7.62224 8.63846 1.01621 5.93449 -5.72993 0.20455
magnitude: 1.05517 au
magnitude: 2.68203 debye
