program: Orca
programVersion: 4.2.1
elementType: O O O N N N N C C C C C C C C C C C C C C H H H H H H H H H H H H H H H H H H
charge: 0
multiplicity: 1
keywords: wb97x-d3
keywords: def2-TZVPP
keywords: def2/J RIJCOSX GRIDX6 NOFINALGRIDX
keywords: grid4 nofinalgrid
keywords: scfconv7
keywords: smallprint printgap noloewdin
keywords: NOSOSCF
formula: C14H18N4O3
InChI: InChI=1S/C14H18N4O3/c1-3-4-9-15-13(19)18-11-8-6-5-7-10(11)16-12(18)17-14(20)21-2/h5-8,15-16H,3-4,9H2,1-2H3
39 atoms
O  -0.749219 -2.707964 0.566554
O  2.524597 2.521793 0.33992
O  0.531011 3.388174 -0.186655
N  -0.919584 -0.455042 0.317585
N  1.115656 -1.451575 0.859051
N  -1.48981 1.60695 -0.157932
N  0.812314 1.147947 0.328698
C  3.353541 -2.275836 0.312245
C  2.053922 -2.53742 1.05947
C  -2.304119 -0.453419 0.081962
C  3.190905 -2.207289 -1.200839
C  -2.647043 0.863345 -0.218797
C  -0.442707 0.833393 0.165721
C  -0.171131 -1.638429 0.592953
C  -3.280162 -1.438605 0.109382
C  -3.94116 1.251358 -0.507017
C  4.508558 -1.956749 -1.917659
C  -4.584787 -1.054009 -0.178231
C  -4.914533 0.263511 -0.483578
C  1.21486 2.429307 0.132818
C  3.120096 3.802312 0.168318
H  4.051613 -3.07635 0.572758
H  3.807958 -1.349334 0.680652
H  2.257053 -2.655476 2.127203
H  1.603609 -3.468495 0.71653
H  2.748262 -3.142093 -1.558641
H  2.483451 -1.415801 -1.463491
H  1.466873 -0.494692 0.820101
H  -3.05695 -2.465931 0.341752
H  -4.179745 2.280448 -0.73918
H  4.371363 -1.911962 -2.999066
H  4.955942 -1.010847 -1.605407
H  5.233836 -2.746512 -1.711546
H  -5.361982 -1.80629 -0.163276
H  -5.941293 0.522759 -0.704056
H  2.714039 4.537092 0.864649
H  4.17893 3.668322 0.375445
H  3.003529 4.17178 -0.851293
H  -1.390896 2.598838 -0.325845
elementType: O N C H
totalener: -989.20747995 hartree
nucrepener: 1701.13503613 hartree
electener: -2690.34251608 hartree
oneelecener: -4725.03840757 hartree
twoeener: 2034.69589148 hartree
cpcmener: -0.02480227 hartree
kineticenergy: 985.03461215 hartree
xcener: -94.234410110504 hartree
chargesum: 0.0000000
charge: -0.513804 -0.308645 -0.531182 -0.039225 -0.232794 -0.142004 -0.474031 -0.111951 -0.051476 0.106571 -0.082083 0.056505 0.382772 0.418936 -0.198334 -0.170444 -0.277525 -0.156991 -0.143890 0.511360 -0.125962 0.073695 0.066428 0.104747 0.097830 0.062230 0.052847 0.190202 0.161581 0.154227 0.091776 0.078475 0.079805 0.157309 0.159254 0.112696 0.125314 0.113205 0.202578
qa: -0.5138 -0.3086 -0.5312 -0.0392 -0.2328 -0.1420 -0.4740 -0.1120 -0.0515 0.1066 -0.0821 0.0565 0.3828 0.4189 -0.1983 -0.1704 -0.2775 -0.1570 -0.1439 0.5114 -0.1260 0.0737 0.0664 0.1047 0.0978 0.0622 0.0528 0.1902 0.1616 0.1542 0.0918 0.0785 0.0798 0.1573 0.1593 0.1127 0.1253 0.1132 0.2026
va: 2.0026 2.0839 1.9574 3.2903 3.2086 3.4278 2.8653 3.8748 3.8724 3.7882 3.8517 3.8728 4.1067 4.2500 3.9929 3.9498 3.9472 3.9107 3.8961 4.2832 3.8787 1.0143 1.0107 1.0014 1.0213 1.0084 1.0233 1.0641 1.0264 0.9999 1.0027 1.0016 1.0006 0.9925 0.9896 0.9937 0.9957 0.9934 1.0286
dispcorr: -0.016182155 hartree
energy: -989.223662110023
dipole: 21.84418 -21.63661 0.20757 -7.57213 8.59725 1.02512 -5.37978 5.25841 -0.12137
magnitude: 1.05294 au
magnitude: 2.67636 debye
