program: Orca
programVersion: 4.2.1
elementType: O O O N N N N C C C C C C C C C C C C C C H H H H H H H H H H H H H H H H H H
charge: 0
multiplicity: 1
keywords: wb97x-d3
keywords: def2-TZVPP
keywords: def2/J RIJCOSX GRIDX6 NOFINALGRIDX
keywords: grid4 nofinalgrid
keywords: scfconv7
keywords: smallprint printgap noloewdin
keywords: NOSOSCF
formula: C14H18N4O3
InChI: InChI=1S/C14H18N4O3/c1-3-4-9-15-13(19)18-11-8-6-5-7-10(11)16-12(18)17-14(20)21-2/h5-8,15-16H,3-4,9H2,1-2H3
39 atoms
O  -0.71684 -2.697173 0.606694
O  2.538955 2.529651 0.315627
O  0.546502 3.394229 -0.222575
N  -0.900192 -0.448142 0.333364
N  1.131221 -1.421722 0.928575
N  -1.478325 1.602662 -0.17911
N  0.824298 1.160944 0.324177
C  3.340526 -2.277968 0.310733
C  2.080408 -2.496311 1.136564
C  -2.282717 -0.458222 0.089169
C  3.099268 -2.274651 -1.193208
C  -2.631513 0.851469 -0.234373
C  -0.4284 0.83969 0.161843
C  -0.147593 -1.623029 0.633703
C  -3.251995 -1.449532 0.126388
C  -3.926667 1.22612 -0.535618
C  4.375072 -2.03918 -1.987059
C  -4.557375 -1.078405 -0.17475
C  -4.893682 0.23206 -0.50224
C  1.228201 2.43889 0.109657
C  3.139948 3.804647 0.124223
H  4.048909 -3.069784 0.570241
H  3.81524 -1.337966 0.613132
H  2.33812 -2.554352 2.197195
H  1.612568 -3.443394 0.871027
H  2.650437 -3.227614 -1.489939
H  2.370083 -1.501287 -1.450345
H  1.477442 -0.463647 0.875064
H  -3.022114 -2.471416 0.375717
H  -4.171003 2.24977 -0.785502
H  5.122271 -2.809019 -1.783815
H  4.18291 -2.044386 -3.060995
H  4.822582 -1.074242 -1.739904
H  -5.329501 -1.83574 -0.153172
H  -5.920851 0.480666 -0.73287
H  4.199035 3.6684 0.328934
H  3.021322 4.160768 -0.89991
H  2.740497 4.550947 0.812119
H  -1.388872 2.592067 -0.364014
elementType: O N C H
totalener: -989.20728668 hartree
nucrepener: 1702.54257117 hartree
electener: -2691.74985785 hartree
oneelecener: -4727.86452947 hartree
twoeener: 2036.11467162 hartree
cpcmener: -0.02493400 hartree
kineticenergy: 985.03483079 hartree
xcener: -94.234314172892 hartree
chargesum: 0.0000000
charge: -0.513030 -0.308872 -0.530169 -0.039007 -0.233913 -0.141317 -0.474728 -0.109103 -0.051059 0.106907 -0.084328 0.055909 0.382604 0.415266 -0.198367 -0.169938 -0.277983 -0.156911 -0.143796 0.511349 -0.126136 0.073619 0.066321 0.104677 0.097758 0.063473 0.053595 0.192136 0.161571 0.154277 0.079877 0.091704 0.078146 0.157238 0.159504 0.125268 0.113133 0.112706 0.201619
qa: -0.5130 -0.3089 -0.5302 -0.0390 -0.2339 -0.1413 -0.4747 -0.1091 -0.0511 0.1069 -0.0843 0.0559 0.3826 0.4153 -0.1984 -0.1699 -0.2780 -0.1569 -0.1438 0.5113 -0.1261 0.0736 0.0663 0.1047 0.0978 0.0635 0.0536 0.1921 0.1616 0.1543 0.0799 0.0917 0.0781 0.1572 0.1595 0.1253 0.1131 0.1127 0.2016
va: 2.0025 2.0829 1.9586 3.2896 3.2094 3.4293 2.8644 3.8668 3.8712 3.7879 3.8524 3.8737 4.1073 4.2530 3.9928 3.9504 3.9463 3.9117 3.8967 4.2840 3.8789 1.0146 1.0111 1.0012 1.0235 1.0083 1.0229 1.0623 1.0264 0.9998 1.0004 1.0028 1.0017 0.9926 0.9895 0.9957 0.9934 0.9936 1.0282
dispcorr: -0.016248999 hartree
energy: -989.223535677899
dipole: 21.41737 -21.22602 0.19135 -7.82296 8.84225 1.01930 -5.54435 5.41579 -0.12856
magnitude: 1.04504 au
magnitude: 2.65627 debye
