program: Orca
programVersion: 4.2.1
elementType: O O O N N N N C C C C C C C C C C C C C C H H H H H H H H H H H H H H H H H H
charge: 0
multiplicity: 1
keywords: wb97x-d3
keywords: def2-TZVPP
keywords: def2/J RIJCOSX GRIDX6 NOFINALGRIDX
keywords: grid4 nofinalgrid
keywords: scfconv7
keywords: smallprint printgap noloewdin
keywords: NOSOSCF
formula: C14H18N4O3
InChI: InChI=1S/C14H18N4O3/c1-3-4-9-15-13(19)18-11-8-6-5-7-10(11)16-12(18)17-14(20)21-2/h5-8,15-16H,3-4,9H2,1-2H3
39 atoms
O  -0.737214 -2.692637 -0.685065
O  2.565948 2.427597 0.145792
O  0.551078 3.307975 0.560316
N  -0.917599 -0.446358 -0.389889
N  1.131269 -1.425211 -0.912949
N  -1.500044 1.580995 0.203749
N  0.829368 1.114705 -0.128271
C  2.884044 -2.784425 0.184089
C  2.073633 -2.512854 -1.07729
C  -2.316056 -0.437811 -0.269951
C  3.766349 -1.616423 0.609723
C  -2.667866 0.857048 0.105636
C  -0.438774 0.816059 -0.095572
C  -0.160012 -1.622819 -0.669152
C  -3.295898 -1.398572 -0.469147
C  -3.978547 1.244307 0.307753
C  4.569914 -1.917358 1.865466
C  -4.616784 -1.014276 -0.269098
C  -4.95689 0.279805 0.115212
C  1.240019 2.360453 0.220292
C  3.17307 3.667725 0.4874
H  3.51061 -3.661633 -0.003688
H  2.20502 -3.058743 0.997609
H  1.534836 -3.407601 -1.38326
H  2.742377 -2.251168 -1.900122
H  4.448507 -1.364353 -0.208578
H  3.156959 -0.723988 0.783196
H  1.486592 -0.478608 -0.788637
H  -3.062462 -2.406737 -0.767293
H  -4.226794 2.255633 0.600227
H  3.916662 -2.124334 2.715508
H  5.215331 -2.787308 1.727861
H  5.208002 -1.076275 2.140771
H  -5.398488 -1.747057 -0.418196
H  -5.996451 0.539382 0.263571
H  2.852284 4.474263 -0.173146
H  2.969369 3.949098 1.521398
H  4.243329 3.518804 0.367313
H  -1.407884 2.55468 0.458653
elementType: O N C H
totalener: -989.20762592 hartree
nucrepener: 1703.57172668 hartree
electener: -2692.77935260 hartree
oneelecener: -4729.92029857 hartree
twoeener: 2037.14094597 hartree
cpcmener: -0.02476998 hartree
kineticenergy: 985.03300530 hartree
xcener: -94.233529224143 hartree
chargesum: -0.0000000
charge: -0.511222 -0.303873 -0.530858 -0.042120 -0.232863 -0.142528 -0.475834 -0.097174 -0.060292 0.108979 -0.077164 0.056599 0.381779 0.409168 -0.199379 -0.168311 -0.279997 -0.155440 -0.145882 0.513203 -0.125476 0.070762 0.066273 0.098897 0.108803 0.063893 0.036784 0.199317 0.159655 0.154497 0.079806 0.080078 0.090996 0.157758 0.159102 0.112360 0.112951 0.124498 0.202255
qa: -0.5112 -0.3039 -0.5309 -0.0421 -0.2329 -0.1425 -0.4758 -0.0972 -0.0603 0.1090 -0.0772 0.0566 0.3818 0.4092 -0.1994 -0.1683 -0.2800 -0.1554 -0.1459 0.5132 -0.1255 0.0708 0.0663 0.0989 0.1088 0.0639 0.0368 0.1993 0.1597 0.1545 0.0798 0.0801 0.0910 0.1578 0.1591 0.1124 0.1130 0.1245 0.2023
va: 2.0010 2.0881 1.9602 3.2892 3.2150 3.4274 2.8699 3.8617 3.8771 3.7850 3.8646 3.8748 4.1144 4.2707 3.9947 3.9477 3.9539 3.9108 3.8969 4.2774 3.8801 1.0142 1.0118 1.0253 0.9994 1.0051 1.0282 1.0533 1.0266 0.9998 1.0011 1.0015 1.0032 0.9924 0.9898 0.9938 0.9935 0.9956 1.0277
dispcorr: -0.016446377 hartree
energy: -989.224072294312
dipole: 22.07032 -21.89163 0.17869 -7.46149 8.49680 1.03530 5.46173 -5.36839 0.09334
magnitude: 1.05475 au
magnitude: 2.68095 debye
