program: Orca
programVersion: 4.2.1
elementType: O O O N N N N C C C C C C C C C C C C C C H H H H H H H H H H H H H H H H H H
charge: 0
multiplicity: 1
keywords: wb97x-d3
keywords: def2-TZVPP
keywords: def2/J RIJCOSX GRIDX6 NOFINALGRIDX
keywords: grid4 nofinalgrid
keywords: scfconv7
keywords: smallprint printgap noloewdin
keywords: NOSOSCF
formula: C14H18N4O3
InChI: InChI=1S/C14H18N4O3/c1-3-4-9-15-13(19)18-11-8-6-5-7-10(11)16-12(18)17-14(20)21-2/h5-8,15-16H,3-4,9H2,1-2H3
39 atoms
O  -0.786384 -2.757374 0.242165
O  2.553196 2.405589 0.423546
O  0.578996 3.348086 -0.046179
N  -0.948987 -0.490448 0.234203
N  1.047009 -1.545957 0.809117
N  -1.483667 1.60342 -0.128553
N  0.806949 1.078586 0.352131
C  2.911162 -2.751109 -0.283619
C  1.975049 -2.652957 0.914665
C  -2.329944 -0.454845 -0.014333
C  3.82151 -1.539824 -0.450883
C  -2.65163 0.881828 -0.240965
C  -0.45114 0.796569 0.161171
C  -0.215108 -1.699549 0.42279
C  -3.319072 -1.426332 -0.041958
C  -3.939297 1.303037 -0.511523
C  4.751091 -1.666742 -1.647868
C  -4.617088 -1.008264 -0.311874
C  -4.926248 0.328741 -0.546081
C  1.24013 2.357964 0.219514
C  3.181127 3.677331 0.314594
H  2.321084 -2.905914 -1.192451
H  3.523196 -3.649215 -0.156341
H  2.555729 -2.51424 1.829274
H  1.413834 -3.57755 1.035846
H  3.224295 -0.629196 -0.560655
H  4.413828 -1.407055 0.46015
H  1.40756 -0.593734 0.845741
H  -3.109446 -2.467499 0.136281
H  -4.163774 2.34665 -0.685993
H  5.404257 -0.797545 -1.738352
H  5.388882 -2.549362 -1.567223
H  4.18894 -1.752078 -2.580015
H  -5.405271 -1.74866 -0.34005
H  -5.948412 0.614131 -0.755449
H  2.798737 4.385096 1.051187
H  4.237339 3.505386 0.50674
H  3.068614 4.102542 -0.683568
H  -1.372495 2.602075 -0.236587
elementType: O N C H
totalener: -989.20750903 hartree
nucrepener: 1703.59736890 hartree
electener: -2692.80487794 hartree
oneelecener: -4729.96898884 hartree
twoeener: 2037.16411091 hartree
cpcmener: -0.02472084 hartree
kineticenergy: 985.03301656 hartree
xcener: -94.233591484325 hartree
chargesum: -0.0000000
charge: -0.511140 -0.303752 -0.530772 -0.041502 -0.232285 -0.142326 -0.474876 -0.096069 -0.059230 0.107820 -0.076201 0.055508 0.381024 0.409022 -0.197655 -0.168317 -0.279055 -0.156279 -0.145259 0.513060 -0.125566 0.065947 0.070214 0.108294 0.098483 0.036603 0.063418 0.198508 0.159922 0.154501 0.090501 0.079496 0.079327 0.157517 0.159492 0.112397 0.124515 0.112837 0.201880
qa: -0.5111 -0.3038 -0.5308 -0.0415 -0.2323 -0.1423 -0.4749 -0.0961 -0.0592 0.1078 -0.0762 0.0555 0.3810 0.4090 -0.1977 -0.1683 -0.2791 -0.1563 -0.1453 0.5131 -0.1256 0.0659 0.0702 0.1083 0.0985 0.0366 0.0634 0.1985 0.1599 0.1545 0.0905 0.0795 0.0793 0.1575 0.1595 0.1124 0.1245 0.1128 0.2019
va: 2.0013 2.0882 1.9600 3.2889 3.2155 3.4272 2.8705 3.8626 3.8752 3.7857 3.8633 3.8745 4.1155 4.2712 3.9941 3.9488 3.9539 3.9117 3.8975 4.2768 3.8803 1.0119 1.0142 0.9995 1.0256 1.0283 1.0052 1.0540 1.0264 0.9997 1.0031 1.0018 1.0011 0.9924 0.9895 0.9937 0.9957 0.9934 1.0281
dispcorr: -0.016444759 hartree
energy: -989.223953791074
dipole: 22.57503 -22.38999 0.18504 -6.76330 7.80193 1.03864 -4.25718 4.31465 0.05748
magnitude: 1.05656 au
magnitude: 2.68555 debye
