program: Orca
programVersion: 4.2.1
elementType: O O O N N N N C C C C C C C C C C C C C C H H H H H H H H H H H H H H H H H H
charge: 0
multiplicity: 1
keywords: wb97x-d3
keywords: def2-TZVPP
keywords: def2/J RIJCOSX GRIDX6 NOFINALGRIDX
keywords: grid4 nofinalgrid
keywords: scfconv7
keywords: smallprint printgap noloewdin
keywords: NOSOSCF
formula: C14H18N4O3
InChI: InChI=1S/C14H18N4O3/c1-3-4-9-15-13(19)18-11-8-6-5-7-10(11)16-12(18)17-14(20)21-2/h5-8,15-16H,3-4,9H2,1-2H3
39 atoms
O  -0.336965 -2.461832 -0.199014
O  2.356149 3.124765 -0.202395
O  0.225811 3.778862 -0.024541
N  -0.741648 -0.222411 -0.165796
N  1.426888 -1.052329 -0.414181
N  -1.550403 1.810736 -0.013084
N  0.823222 1.546499 -0.188313
C  3.00117 -2.407907 0.932316
C  2.438983 -2.083524 -0.447884
C  -2.136926 -0.337772 -0.073592
C  4.142715 -3.419731 0.894602
C  -2.634957 0.960899 0.020387
C  -0.403389 1.115004 -0.125574
C  0.136207 -1.350921 -0.25618
C  -3.001916 -1.420353 -0.070699
C  -3.985174 1.233155 0.120917
C  3.726595 -4.805922 0.419308
C  -4.361112 -1.150175 0.029822
C  -4.84933 0.14862 0.124694
C  1.049822 2.887253 -0.129432
C  2.760128 4.481565 -0.14947
H  2.193305 -2.785015 1.565898
H  3.353355 -1.481486 1.394653
H  2.015038 -2.972417 -0.913227
H  3.240963 -1.733441 -1.102277
H  4.947509 -3.03787 0.258253
H  4.569423 -3.499105 1.897264
H  1.694756 -0.069866 -0.381229
H  -2.642348 -2.432422 -0.141558
H  -4.350379 2.248651 0.19235
H  4.556358 -5.509906 0.484804
H  2.910254 -5.200324 1.026593
H  3.388906 -4.803194 -0.617485
H  -5.055022 -1.979528 0.034318
H  -5.914671 0.317186 0.201665
H  2.347412 5.062736 -0.975033
H  2.468957 4.957239 0.787935
H  3.8445 4.47193 -0.224697
H  -1.5244 2.820538 0.036087
totalener: -989.18563049 hartree
nucrepener: 1676.52525461 hartree
electener: -2665.71088511 hartree
oneelecener: -4675.48215234 hartree
twoeener: 2009.77126723 hartree
kineticenergy: 985.06884458 hartree
xcener: -94.235608845640 hartree
chargesum: -0.0000000
charge: -0.433431 -0.279804 -0.472991 -0.053363 -0.241403 -0.167630 -0.453098 -0.112312 -0.047065 0.078129 -0.110637 0.041478 0.370816 0.386832 -0.156701 -0.131298 -0.250701 -0.115152 -0.115118 0.468452 -0.129250 0.078163 0.068076 0.094279 0.094259 0.051432 0.068059 0.188524 0.157130 0.121811 0.083877 0.083186 0.072428 0.125215 0.125016 0.107128 0.107063 0.116021 0.182580
qa: -0.4334 -0.2798 -0.4730 -0.0534 -0.2414 -0.1676 -0.4531 -0.1123 -0.0471 0.0781 -0.1106 0.0415 0.3708 0.3868 -0.1567 -0.1313 -0.2507 -0.1152 -0.1151 0.4685 -0.1293 0.0782 0.0681 0.0943 0.0943 0.0514 0.0681 0.1885 0.1571 0.1218 0.0839 0.0832 0.0724 0.1252 0.1250 0.1071 0.1071 0.1160 0.1826
va: 2.0770 2.1090 2.0162 3.2984 3.2224 3.4072 2.8849 3.8672 3.8574 3.8895 3.9055 3.9191 4.1025 4.2619 4.0345 4.0044 3.9352 3.9399 3.9692 4.3117 3.9075 1.0159 1.0212 1.0202 1.0007 1.0091 1.0076 1.0663 1.0288 1.0085 1.0051 1.0020 1.0030 1.0028 1.0008 0.9955 0.9955 0.9942 1.0545
dispcorr: -0.015573940 hartree
energy: -989.201204432031
dipole: 20.24111 -20.12247 0.11864 -15.20306 15.82139 0.61833 3.22121 -3.15587 0.06534
magnitude: 0.63299 au
magnitude: 1.60894 debye
