program: Orca
programVersion: 4.2.1
elementType: O O O N N N N C C C C C C C C C C C C C C H H H H H H H H H H H H H H H H H H
charge: 0
multiplicity: 1
keywords: wb97x-d3
keywords: def2-TZVPP
keywords: def2/J RIJCOSX GRIDX6 NOFINALGRIDX
keywords: grid4 nofinalgrid
keywords: scfconv7
keywords: smallprint printgap noloewdin
keywords: NOSOSCF
formula: C14H18N4O3
InChI: InChI=1S/C14H18N4O3/c1-3-4-9-15-13(19)18-11-8-6-5-7-10(11)16-12(18)17-14(20)21-2/h5-8,15-16H,3-4,9H2,1-2H3
39 atoms
O  -0.566014 -2.613252 0.764445
O  2.496265 2.753749 0.267197
O  0.457972 3.475773 -0.299711
N  -0.809441 -0.387177 0.35686
N  1.251047 -1.27969 1.001151
N  -1.441877 1.628605 -0.232495
N  0.866564 1.275425 0.298381
C  2.70313 -3.035966 0.012189
C  2.177862 -2.357043 1.272625
C  -2.187566 -0.4445 0.099193
C  3.456248 -2.095321 -0.919348
C  -2.573367 0.842577 -0.271899
C  -0.371591 0.903794 0.144081
C  -0.029129 -1.531145 0.721453
C  -3.121135 -1.4667 0.158248
C  -3.877316 1.160668 -0.597476
C  3.957471 -2.793736 -2.174947
C  -4.434009 -1.149791 -0.167483
C  -4.810317 0.136293 -0.539961
C  1.195839 2.573829 0.05658
C  2.999634 4.061274 0.056679
H  1.867308 -3.50085 -0.517582
H  3.362315 -3.854509 0.318188
H  3.006389 -1.926947 1.838711
H  1.695992 -3.089617 1.920289
H  2.809468 -1.260627 -1.203433
H  4.302483 -1.652884 -0.38388
H  1.587545 -0.327374 0.870191
H  -2.84569 -2.468048 0.441482
H  -4.157472 2.165036 -0.884619
H  4.638314 -3.610996 -1.931272
H  3.130427 -3.216861 -2.747233
H  4.491431 -2.104666 -2.829394
H  -5.180799 -1.930914 -0.129524
H  -5.842381 0.34268 -0.787959
H  2.532285 4.789923 0.720334
H  4.063341 4.008851 0.27427
H  2.858966 4.391361 -0.973352
H  -1.337237 2.612585 -0.441189
totalener: -989.18681211 hartree
nucrepener: 1700.39918432 hartree
electener: -2689.58599643 hartree
oneelecener: -4723.20408682 hartree
twoeener: 2033.61809039 hartree
kineticenergy: 985.07226219 hartree
xcener: -94.235802477359 hartree
chargesum: -0.0000000
charge: -0.430828 -0.279422 -0.472872 -0.051363 -0.245920 -0.166895 -0.454982 -0.102677 -0.064678 0.078188 -0.093691 0.043119 0.371797 0.385514 -0.157432 -0.132741 -0.257659 -0.113546 -0.115783 0.469158 -0.129670 0.077319 0.065775 0.094930 0.102077 0.055912 0.054403 0.194951 0.156111 0.122363 0.073084 0.076089 0.085020 0.125143 0.125740 0.107338 0.115893 0.107151 0.183082
qa: -0.4308 -0.2794 -0.4729 -0.0514 -0.2459 -0.1669 -0.4550 -0.1027 -0.0647 0.0782 -0.0937 0.0431 0.3718 0.3855 -0.1574 -0.1327 -0.2577 -0.1135 -0.1158 0.4692 -0.1297 0.0773 0.0658 0.0949 0.1021 0.0559 0.0544 0.1950 0.1561 0.1224 0.0731 0.0761 0.0850 0.1251 0.1257 0.1073 0.1159 0.1072 0.1831
va: 2.0802 2.1095 2.0167 3.2948 3.1980 3.4098 2.8772 3.7978 3.9145 3.8853 3.8703 3.9198 4.0967 4.2711 4.0329 4.0047 3.9552 3.9403 3.9709 4.3097 3.9072 1.0192 1.0163 1.0000 1.0181 1.0245 1.0077 1.0592 1.0291 1.0085 1.0029 1.0036 1.0049 1.0026 1.0006 0.9954 0.9945 0.9953 1.0540
dispcorr: -0.016145540 hartree
energy: -989.202957647427
dipole: 19.80986 -19.69103 0.11884 -10.03646 10.68765 0.65119 -5.98982 5.84412 -0.14571
magnitude: 0.67779 au
magnitude: 1.72281 debye
