program: Orca
programVersion: 4.2.1
elementType: O O O N N N N C C C C C C C C C C C C C C H H H H H H H H H H H H H H H H H H
charge: 0
multiplicity: 1
keywords: wb97x-d3
keywords: def2-TZVPP
keywords: def2/J RIJCOSX GRIDX6 NOFINALGRIDX
keywords: grid4 nofinalgrid
keywords: scfconv7
keywords: smallprint printgap noloewdin
keywords: NOSOSCF
formula: C14H18N4O3
InChI: InChI=1S/C14H18N4O3/c1-3-4-9-15-13(19)18-11-8-6-5-7-10(11)16-12(18)17-14(20)21-2/h5-8,15-16H,3-4,9H2,1-2H3
39 atoms
O  -0.632716 -2.711811 -0.609166
O  2.567814 2.544505 0.049337
O  0.516419 3.360099 0.404652
N  -0.839767 -0.462408 -0.319172
N  1.227569 -1.427018 -0.805185
N  -1.445637 1.58648 0.176559
N  0.886637 1.137452 -0.131382
C  2.694772 -3.047065 0.369307
C  2.160698 -2.520203 -0.959642
C  -2.236489 -0.463977 -0.188883
C  3.316272 -1.980704 1.267568
C  -2.605598 0.843822 0.121971
C  -0.374319 0.815281 -0.087772
C  -0.07044 -1.642453 -0.584688
C  -3.198723 -1.452039 -0.321646
C  -3.921517 1.216392 0.314486
C  4.47862 -1.227689 0.633209
C  -4.523557 -1.08023 -0.130295
C  -4.883557 0.226255 0.183182
C  1.24609 2.422984 0.132282
C  3.105007 3.83081 0.302685
H  3.436778 -3.821316 0.149342
H  1.881097 -3.54485 0.902449
H  1.679202 -3.326554 -1.5121
H  2.978099 -2.156951 -1.584359
H  2.549177 -1.266275 1.578419
H  3.659018 -2.464153 2.185604
H  1.57487 -0.478415 -0.670794
H  -2.935384 -2.468618 -0.559234
H  -4.189216 2.236054 0.55613
H  4.955147 -0.565461 1.355899
H  5.242843 -1.912396 0.260202
H  4.160185 -0.600521 -0.200989
H  -5.293386 -1.833346 -0.227852
H  -5.925929 0.475836 0.326199
H  2.741389 4.57264 -0.409532
H  2.874473 4.177345 1.310927
H  4.18196 3.729404 0.196121
H  -1.322565 2.569598 0.379012
totalener: -989.18563527 hartree
nucrepener: 1717.75448080 hartree
electener: -2706.94011607 hartree
oneelecener: -4757.90425007 hartree
twoeener: 2050.96413400 hartree
kineticenergy: 985.07060489 hartree
xcener: -94.236821146947 hartree
chargesum: 0.0000000
charge: -0.428088 -0.277240 -0.472973 -0.052914 -0.236550 -0.165642 -0.455401 -0.120478 -0.086028 0.077683 -0.119781 0.045398 0.367476 0.383126 -0.157785 -0.133085 -0.248305 -0.113528 -0.116227 0.472050 -0.128855 0.069804 0.088342 0.103757 0.105888 0.060528 0.070422 0.192930 0.156220 0.121609 0.086999 0.079195 0.068178 0.125259 0.125844 0.107215 0.106963 0.114849 0.183144
qa: -0.4281 -0.2772 -0.4730 -0.0529 -0.2365 -0.1656 -0.4554 -0.1205 -0.0860 0.0777 -0.1198 0.0454 0.3675 0.3831 -0.1578 -0.1331 -0.2483 -0.1135 -0.1162 0.4721 -0.1289 0.0698 0.0883 0.1038 0.1059 0.0605 0.0704 0.1929 0.1562 0.1216 0.0870 0.0792 0.0682 0.1253 0.1258 0.1072 0.1070 0.1148 0.1831
va: 2.0837 2.1087 2.0174 3.2963 3.1908 3.4099 2.8872 3.8322 3.8997 3.8879 3.8816 3.9167 4.1044 4.2797 4.0352 4.0043 3.9370 3.9421 3.9699 4.2996 3.9065 1.0155 1.0176 1.0226 0.9913 1.0216 1.0115 1.0579 1.0285 1.0087 1.0086 1.0034 1.0078 1.0027 1.0004 0.9955 0.9955 0.9943 1.0537
dispcorr: -0.017195123 hartree
energy: -989.202830395391
dipole: 20.82333 -20.69529 0.12803 -6.63893 7.30979 0.67086 3.83018 -3.68639 0.14379
magnitude: 0.69794 au
magnitude: 1.77402 debye
