program: Orca
programVersion: 4.2.1
elementType: O O O N N N N C C C C C C C C C C C C C C H H H H H H H H H H H H H H H H H H
charge: 0
multiplicity: 1
keywords: wb97x-d3
keywords: def2-TZVPP
keywords: def2/J RIJCOSX GRIDX6 NOFINALGRIDX
keywords: grid4 nofinalgrid
keywords: scfconv7
keywords: smallprint printgap noloewdin
keywords: NOSOSCF
formula: C14H18N4O3
InChI: InChI=1S/C14H18N4O3/c1-3-4-9-15-13(19)18-11-8-6-5-7-10(11)16-12(18)17-14(20)21-2/h5-8,15-16H,3-4,9H2,1-2H3
39 atoms
O  -0.660322 -2.755153 -0.435831
O  2.641625 2.464575 -0.143268
O  0.6117 3.341939 0.18929
N  -0.828426 -0.487355 -0.301898
N  1.208472 -1.513059 -0.784697
N  -1.390515 1.599432 0.072627
N  0.929472 1.086719 -0.229809
C  2.750747 -2.993235 0.470433
C  2.132163 -2.620859 -0.874639
C  -2.222928 -0.454375 -0.155255
C  3.418892 -1.830726 1.201217
C  -2.564674 0.877221 0.075852
C  -0.336976 0.792678 -0.154085
C  -0.083527 -1.695875 -0.505787
C  -3.203657 -1.4314 -0.212419
C  -3.871675 1.285481 0.2568
C  4.524795 -1.145445 0.408747
C  -4.51932 -1.023875 -0.031207
C  -4.852456 0.306757 0.19965
C  1.318309 2.376493 -0.041938
C  3.209813 3.749226 0.03903
H  3.483683 -3.786955 0.294439
H  1.975166 -3.426319 1.107012
H  1.617622 -3.481335 -1.300221
H  2.909113 -2.335906 -1.585995
H  2.665943 -1.089921 1.483718
H  3.829269 -2.208318 2.140848
H  1.568808 -0.562059 -0.717184
H  -2.960597 -2.466016 -0.384847
H  -4.119101 2.323267 0.434182
H  4.139759 -0.612484 -0.461764
H  5.042877 -0.407557 1.020811
H  5.268345 -1.863242 0.056789
H  -5.303311 -1.767629 -0.07008
H  -5.888605 0.584212 0.336442
H  2.847705 4.464943 -0.700252
H  3.006293 4.147013 1.034167
H  4.282237 3.619897 -0.082641
H  -1.244857 2.59021 0.214163
totalener: -989.18532169 hartree
nucrepener: 1719.92774069 hartree
electener: -2709.11306237 hartree
oneelecener: -4762.24353952 hartree
twoeener: 2053.13047715 hartree
kineticenergy: 985.07138724 hartree
xcener: -94.236961403847 hartree
chargesum: -0.0000000
charge: -0.426545 -0.276243 -0.472920 -0.053238 -0.234552 -0.166011 -0.455795 -0.119984 -0.085788 0.077868 -0.119652 0.044845 0.367047 0.381220 -0.157001 -0.132490 -0.249167 -0.113979 -0.117008 0.472328 -0.128885 0.069237 0.087438 0.104265 0.106142 0.060530 0.070068 0.191542 0.155854 0.122246 0.067498 0.086771 0.080835 0.125374 0.126074 0.107250 0.107387 0.114152 0.183286
qa: -0.4265 -0.2762 -0.4729 -0.0532 -0.2346 -0.1660 -0.4558 -0.1200 -0.0858 0.0779 -0.1197 0.0448 0.3670 0.3812 -0.1570 -0.1325 -0.2492 -0.1140 -0.1170 0.4723 -0.1289 0.0692 0.0874 0.1043 0.1061 0.0605 0.0701 0.1915 0.1559 0.1222 0.0675 0.0868 0.0808 0.1254 0.1261 0.1072 0.1074 0.1142 0.1833
va: 2.0854 2.1089 2.0178 3.2956 3.1917 3.4104 2.8875 3.8386 3.8985 3.8869 3.8773 3.9175 4.1056 4.2823 4.0361 4.0063 3.9363 3.9425 3.9711 4.2987 3.9064 1.0156 1.0166 1.0235 0.9912 1.0230 1.0119 1.0590 1.0285 1.0085 1.0082 1.0089 1.0035 1.0027 1.0004 0.9957 0.9952 0.9943 1.0536
dispcorr: -0.017354290 hartree
energy: -989.202675976848
dipole: 21.02795 -20.88662 0.14133 -6.21245 6.89924 0.68678 3.37380 -3.29249 0.08131
magnitude: 0.70587 au
magnitude: 1.79418 debye
