program: Orca
programVersion: 4.2.1
elementType: O O O N N N N C C C C C C C C C C C C C C H H H H H H H H H H H H H H H H H H
charge: 0
multiplicity: 1
keywords: wb97x-d3
keywords: def2-TZVPP
keywords: def2/J RIJCOSX GRIDX6 NOFINALGRIDX
keywords: grid4 nofinalgrid
keywords: scfconv7
keywords: smallprint printgap noloewdin
keywords: NOSOSCF
formula: C14H18N4O3
InChI: InChI=1S/C14H18N4O3/c1-3-4-9-15-13(19)18-11-8-6-5-7-10(11)16-12(18)17-14(20)21-2/h5-8,15-16H,3-4,9H2,1-2H3
39 atoms
O  -0.575011 -2.614687 -0.780095
O  2.514516 2.690444 0.040062
O  0.449201 3.437435 0.457365
N  -0.824022 -0.386998 -0.384142
N  1.252897 -1.283318 -0.961283
N  -1.468869 1.627732 0.195106
N  0.867245 1.246793 -0.168552
C  2.789921 -2.9441 0.060826
C  2.192034 -2.354321 -1.211879
C  -2.217906 -0.427013 -0.229224
C  3.58519 -1.938667 0.884295
C  -2.611849 0.859856 0.134277
C  -0.384588 0.892489 -0.114972
C  -0.035171 -1.535011 -0.719328
C  -3.159391 -1.432524 -0.378505
C  -3.93236 1.194234 0.361974
C  4.180723 -2.554469 2.142172
C  -4.488851 -1.099184 -0.150987
C  -4.873581 0.18678 0.213092
C  1.198143 2.531133 0.136617
C  3.022762 3.978624 0.338389
H  3.439849 -3.777375 -0.224825
H  1.987755 -3.376586 0.665519
H  1.695712 -3.13245 -1.790668
H  2.985255 -1.94523 -1.8412
H  4.38715 -1.519236 0.268076
H  2.945425 -1.096064 1.161052
H  1.588077 -0.335853 -0.79541
H  -2.877777 -2.434058 -0.655379
H  -4.218398 2.19865 0.64301
H  4.746941 -1.821173 2.716511
H  3.401351 -2.952299 2.793932
H  4.856377 -3.376623 1.900507
H  -5.242212 -1.867117 -0.260579
H  -5.918788 0.406394 0.382182
H  2.796284 4.279381 1.362097
H  4.100537 3.908664 0.215792
H  2.632419 4.738625 -0.339632
H  -1.36251 2.605389 0.431494
totalener: -989.18687935 hartree
nucrepener: 1700.26868215 hartree
electener: -2689.45556150 hartree
oneelecener: -4722.93436336 hartree
twoeener: 2033.47880186 hartree
kineticenergy: 985.07094722 hartree
xcener: -94.235501174293 hartree
chargesum: 0.0000000
charge: -0.429503 -0.279223 -0.473064 -0.052724 -0.243577 -0.166948 -0.455477 -0.100434 -0.067405 0.078207 -0.093085 0.044124 0.370816 0.384777 -0.158567 -0.132199 -0.258089 -0.112804 -0.116303 0.469812 -0.128816 0.064796 0.075829 0.102109 0.096935 0.055008 0.055704 0.194164 0.155993 0.121632 0.085313 0.075931 0.073105 0.125172 0.125769 0.106585 0.115933 0.107138 0.183367
qa: -0.4295 -0.2792 -0.4731 -0.0527 -0.2436 -0.1669 -0.4555 -0.1004 -0.0674 0.0782 -0.0931 0.0441 0.3708 0.3848 -0.1586 -0.1322 -0.2581 -0.1128 -0.1163 0.4698 -0.1288 0.0648 0.0758 0.1021 0.0969 0.0550 0.0557 0.1942 0.1560 0.1216 0.0853 0.0759 0.0731 0.1252 0.1258 0.1066 0.1159 0.1071 0.1834
va: 2.0807 2.1089 2.0174 3.2949 3.2019 3.4092 2.8787 3.8090 3.9111 3.8867 3.8717 3.9186 4.0992 4.2732 4.0347 4.0027 3.9560 3.9409 3.9696 4.3076 3.9074 1.0163 1.0173 1.0208 0.9995 1.0073 1.0248 1.0589 1.0287 1.0087 1.0049 1.0037 1.0030 1.0026 1.0005 0.9956 0.9943 0.9953 1.0541
dispcorr: -0.016156743 hartree
energy: -989.203036094623
dipole: 20.56018 -20.43726 0.12292 -9.30350 9.96496 0.66146 6.13468 -6.01544 0.11924
magnitude: 0.68327 au
magnitude: 1.73673 debye
