program: Gaussian 16
title: Title Card Required
version: ES64L-G16RevC.01
method: RmPW1PW91
basis: 6-31+G(d,p)
operation: Freq
keyword: #N
keyword: Geom=AllCheck
keyword: Guess=TCheck
keyword: SCRF=Check
keyword: GenChk
keyword: RmPW1PW91/6-31+G(d,p)
keyword: Freq
converged: YES YES NO YES
title: Mulliken charges:
elementType: C C C C C C H H H H H H C H H H C H C H H C C H H O H C H H H C H H H C H H H C C H H C H C H H C H H H C H H C C C H H C H H H C H H C C H H C C H H H C H H H H H
charge: 0.110547 0.147963 -0.063792 -0.462381 -0.251284 -0.383706 0.139941 0.163211 0.162497 0.181483 0.157841 0.145420 -0.402874 0.172786 0.155359 0.169289 -0.119085 0.130407 -0.356855 0.165178 0.164714 -0.063223 -0.076044 0.162399 0.161034 -0.464546 0.362563 -0.580607 0.156783 0.162202 0.204174 -0.478299 0.154745 0.199126 0.160389 -0.317532 0.159097 0.158069 0.180567 -0.869681 -0.372476 0.165935 0.168131 -0.301585 0.178584 -0.317694 0.177874 0.117894 -0.179747 0.147478 0.193020 0.186989 0.153087 0.186801 0.157805 -0.491702 -0.250043 -0.312121 0.183738 0.177558 -0.528685 0.193644 0.197253 0.157688 0.128286 0.200778 0.178988 0.148806 -0.518682 0.205485 0.204851 0.261804 -0.699256 0.236923 0.249246 0.250644 -0.373618 0.207888 0.207682 0.190178 0.213772 0.218926
chargesum: 1.00000
title: Mulliken charges with hydrogens summed into heavy atoms:
elementType: C C C C C C C C C C C O C C C C C C C C C C C C C C C C C C C
charge: 0.250488 0.147963 0.081627 -0.462381 0.074424 -0.044381 0.094560 0.011322 -0.026962 -0.063223 0.247389 -0.101984 -0.057449 0.035960 0.180200 -0.869681 -0.038410 -0.123002 -0.021925 0.347741 0.497692 -0.277930 -0.250043 0.049175 0.019900 0.508052 0.367733 -0.108346 0.261804 0.037557 0.232130
1716.lowfreq: -58.2156 -5.7258 -0.0004 0.0007 0.0010 3.3005 5.4373 31.9983 45.6228
frequency: -58.2146 31.9787 45.6186 59.4705 77.6316 82.3690 104.5231 117.2495 143.6428 155.0980 170.6275 174.4128 199.8909 205.9633 212.6186 226.1430 230.9787 236.7308 238.8338 248.5561 257.6164 259.8174 263.1682 269.0471 272.8138 274.4572 283.5725 299.9209 308.2803 314.6514 318.0687 323.0870 327.1094 336.4235 342.6448 348.4389 357.1437 363.6382 384.2386 394.3158 398.9823 403.5356 413.7005 430.4113 442.9672 448.1387 464.4609 467.0152 480.0685 493.3141 504.3814 509.6119 519.9815 533.3723 558.2247 567.0918 574.5763 612.9907 621.6819 628.5613 662.1568 694.4933 709.3590 741.8028 748.5978 760.5987 768.5259 784.2339 811.3140 837.5292 848.5662 870.2243 877.6904 895.3680 909.9180 916.7660 920.4832 931.7476 933.2620 941.4857 945.5677 953.0132 954.8474 968.7961 970.7807 979.3438 986.5704 990.4484 992.1828 1006.6374 1010.9007 1016.7129 1020.8337 1029.1134 1037.4910 1040.7434 1045.4678 1055.6792 1056.7323 1060.8808 1065.3664 1086.0552 1096.8320 1102.6549 1103.0209 1111.5410 1123.4981 1126.7160 1138.7717 1141.8210 1153.8609 1156.9083 1169.1619 1170.7108 1181.2550 1192.8595 1199.1771 1200.2130 1207.4035 1213.1314 1225.6980 1227.8418 1230.0334 1231.3083 1233.1660 1244.0915 1254.0434 1260.7161 1270.4634 1284.1396 1291.6641 1295.2010 1308.3952 1322.0430 1330.7474 1336.1516 1346.5004 1350.4352 1351.2513 1354.3583 1356.4163 1363.6975 1366.6556 1373.3934 1376.0263 1382.1138 1384.0261 1385.8073 1390.4763 1394.6980 1396.6200 1402.2835 1405.1007 1407.6510 1413.7729 1417.2424 1422.6374 1429.8418 1431.3340 1435.4551 1439.9129 1442.5086 1453.1933 1474.0220 1480.1721 1483.2872 1485.9138 1486.7844 1489.0180 1490.6444 1492.3869 1495.0991 1498.0057 1499.4834 1499.9577 1500.6910 1504.7037 1505.4661 1509.9077 1513.9963 1515.0291 1518.1793 1518.4983 1520.0244 1525.2245 1526.4242 1534.4191 1537.1239 1545.2450 2972.4074 2980.2186 3008.7950 3033.6917 3039.4947 3052.0088 3059.7095 3060.3420 3060.7492 3063.8007 3064.9321 3066.5876 3067.9378 3069.4887 3078.1809 3078.6525 3081.5552 3083.5591 3085.4525 3088.6456 3089.2968 3090.1569 3095.1441 3099.2498 3100.9412 3109.2280 3115.4559 3116.0491 3118.7246 3133.9082 3134.7585 3138.1091 3138.2941 3142.4422 3146.0207 3147.8268 3149.3326 3158.6551 3160.9276 3163.0939 3166.8803 3168.2328 3172.2731 3172.3101 3174.9925 3180.1950 3183.8809 3186.3784 3213.4685 3237.2206 3898.7523
redmass: 2.4589 3.4925 3.3203 2.8824 2.7233 3.7403 2.2310 3.0692 1.6230 2.1589 3.0283 2.5790 1.6555 1.5437 1.4661 1.6811 1.4492 1.9920 1.3703 1.2511 1.4740 1.1911 1.8122 2.1402 1.5487 2.2333 1.9380 2.1333 2.7456 2.3408 2.4415 2.5189 2.3428 2.3742 2.4302 2.4697 2.3950 2.4378 2.5468 2.2075 2.4203 2.3640 2.6854 2.7143 2.6245 2.7402 2.6290 3.0023 2.5787 2.7242 2.7178 2.7882 2.9621 2.7522 2.6646 2.4545 2.6155 2.3876 3.6974 2.7886 2.8210 2.6834 2.6660 3.0946 2.7149 2.7460 2.2259 2.2173 2.1170 1.9899 2.1468 1.9422 1.9075 1.8357 1.6664 1.7723 1.7620 1.5719 1.7779 1.7740 1.6209 1.4306 1.5151 1.8541 1.5954 1.7059 1.8334 1.8486 1.7337 1.6085 1.6721 1.6757 1.6604 1.7582 1.9203 1.8314 1.9970 1.6709 1.9683 1.7650 1.8033 2.3086 1.7718 1.8249 2.1601 2.1061 1.6609 2.3217 2.1266 2.1893 1.8226 2.4130 2.1860 2.2890 1.8778 2.1324 2.1144 1.7127 1.8374 1.6710 1.7464 1.8535 1.5720 2.6083 1.7031 1.7913 1.8001 1.6154 1.4543 1.7637 1.6119 1.5938 1.6004 1.7376 1.7251 1.4918 1.4254 1.3123 1.2372 1.2910 1.3629 1.3715 1.3250 1.3947 1.4027 1.4848 1.3687 1.4978 1.6617 1.4446 1.5483 1.3938 1.4759 1.4607 1.4142 1.4286 1.2249 1.2764 1.2468 1.2500 1.2856 1.3366 1.0942 1.1330 1.0667 1.0978 1.0767 1.0673 1.0720 1.1058 1.0801 1.0847 1.0695 1.0839 1.0715 1.0813 1.0789 1.0741 1.0776 1.0709 1.0713 1.0628 1.0629 1.0607 1.0636 1.0646 1.0574 1.0514 2.1607 1.0821 1.0821 1.0771 1.0659 1.0602 1.0791 1.0422 1.0652 1.0639 1.0521 1.0580 1.0552 1.0835 1.0372 1.0717 1.0370 1.0496 1.0473 1.0544 1.0760 1.0631 1.0420 1.0655 1.0866 1.0688 1.0983 1.0972 1.0965 1.0977 1.1003 1.1025 1.0985 1.0974 1.0971 1.0950 1.1003 1.0933 1.0993 1.0992 1.0991 1.1005 1.1038 1.1009 1.1034 1.0990 1.0899 1.0995 1.0989 1.0926 1.1091 1.0667
irintensity: 46.6939 1.0866 0.7001 2.5914 0.3280 1.5765 1.9208 1.2964 1.8824 6.8305 1.7813 0.3474 1.9876 0.0638 0.6969 7.7188 6.5834 1.9304 22.2933 59.3615 20.3785 0.9864 3.3761 0.4598 1.5211 4.4426 1.5481 12.4618 3.0245 5.3503 2.7257 6.6792 3.9588 11.7449 3.1950 1.3363 15.8082 0.2745 4.4384 3.8204 5.0263 0.4547 2.2513 0.8670 0.6549 1.1955 0.1683 0.3516 0.3506 3.6121 0.7616 1.1274 1.8732 1.0062 0.4985 0.1526 3.0488 1.9847 38.6286 5.9332 19.7049 0.9223 0.7796 2.3300 6.6402 7.4354 32.2718 2.2816 0.4141 0.2436 11.7564 1.3775 1.7673 2.1355 20.6532 3.1270 1.8400 2.0870 7.0029 2.0437 8.3521 9.8265 0.6996 1.0437 1.5956 1.1521 0.7583 14.2913 20.1249 14.8517 9.6146 8.5988 6.6768 6.9221 1.4542 4.4526 12.8229 0.1424 2.6767 6.3218 5.0078 43.8228 9.0912 15.8455 0.7825 2.5662 15.9878 10.0758 8.4191 2.0089 14.4069 3.1789 3.7828 46.6764 9.8204 22.8315 5.2347 21.4230 14.5324 0.2922 1.6731 5.2885 7.4059 3.0085 8.7150 4.5884 6.2540 2.6209 31.7784 3.5951 0.9932 2.6480 5.7235 3.1128 0.5739 1.5139 2.9631 3.7250 3.6955 5.3341 0.5420 8.3601 0.8054 0.1278 3.5067 2.2535 0.2114 0.6255 6.3572 0.0382 2.3927 13.8304 4.2332 8.9254 4.6649 7.3314 7.4724 14.4522 17.5696 21.4943 5.8216 14.2898 17.9014 7.4730 0.2489 4.8434 0.9558 1.2280 5.7098 0.2555 5.1385 3.3651 8.0087 12.7481 7.8374 18.0434 12.6328 6.8400 8.6824 18.8439 1.4465 3.6145 2.7376 13.0119 5.5097 10.8151 9.8677 7.2616 35.9525 4.1647 58.4025 27.7841 32.6653 71.5447 12.6014 38.2028 9.6343 40.9470 39.5866 17.1785 8.1677 11.6745 3.0059 5.3060 2.8604 2.5123 62.1116 12.3323 10.9284 11.0712 15.1756 29.5714 31.3135 29.6497 3.8881 8.8708 69.3217 16.9979 30.7380 14.7002 21.1636 21.3581 23.5011 31.7147 43.2331 2.3336 11.7369 31.4537 20.8774 16.9813 5.4201 23.9733 3.4598 12.0955 6.0028 19.5957 14.8868 11.6441 3.0744 40.2417
temp: 298.150 k
press: 1.00000 atm
elementType: 6 6 6 6 6 6 1 1 1 1 1 1 6 1 1 1 6 1 6 1 1 6 6 1 1 8 1 6 1 1 1 6 1 1 1 6 1 1 1 6 6 1 1 6 1 6 1 1 6 1 1 1 6 1 1 6 6 6 1 1 6 1 1 1 6 1 1 6 6 1 1 6 6 1 1 1 6 1 1 1 1 1
symmnumber: 1
zpe: 2006908.6 jmol-1
zpe.correction: 0.764391 hartree
zpe.thermalcorrener: 0.795195 hartree
zpe.thermalcorrenthalpy: 0.796140 hartree
zpe.thermalcorrgfe: 0.708625 hartree
zpe.sumelectzpe: -1247.929494 hartree
zpe.sumelectthermal: -1247.898690 hartree
zpe.sumelectthermalent: -1247.897746 hartree
zpe.sumelectthermalfe: -1247.985260 hartree
dipole: 18.6421 4.5667 -1.7099
dipole: 19.2693
quadrupole: -90.0435 -170.6185 -185.2788
quadrupole: 13.8854 -1.3684 -4.5869
quadrupole: 58.6035 -21.9716 -36.6319 13.8854 -1.3684 -4.5869
hfenergy: -1248.6938851 hartree
pointgroup: C01 [X(C30H51O1)]
dipole: 7.3458369 1.7843171 -0.5732503 debye
polarizability: 413.2298182|8.4570305|305.4032995|0.5530549|-0.2533414|267.7155738 unknown
InChI: InChI=1S/C30H51O/c1-25(2)15-16-27(5)17-18-29(7)20(21(27)19-25)9-10-23-28(6)13-12-24(31)26(3,4)22(28)11-14-30(23,29)8/h19-24,31H,9-18H2,1-8H3
charge 1 multiplicity 1
82 atoms
C  -5.37928053 1.02935096 -0.85380298
C  -5.0176897 -0.35781699 -0.28332677
C  -3.46176206 -0.44898095 -0.25205939
C  -2.6909364 0.69245767 0.47949277
C  -3.1779183 2.03327779 -0.11848381
C  -4.69747871 2.1751202 -0.12114344
H  -5.03509626 1.03896348 -1.90299839
H  -2.75036356 2.87720087 0.4328311
H  -2.81425772 2.11669617 -1.15268463
H  -5.09608331 2.23354403 0.89673606
H  -4.96657237 3.12295934 -0.60361864
H  -3.17521597 -0.32646606 -1.31145153
C  -2.92481437 0.74339589 2.00380323
H  -3.12126745 -0.23315145 2.44766598
H  -2.06811023 1.17709038 2.5251203
H  -3.78274895 1.37018488 2.2499367
C  -1.17532796 0.51759174 0.09478636
H  -1.19993705 0.62867476 -0.99668644
C  -2.92055946 -1.81774291 0.15954605
H  -3.48496919 -2.61120784 -0.33586097
H  -3.05347998 -1.98633094 1.23323309
C  -0.53159518 -0.88450247 0.35762507
C  -1.45358822 -1.96814931 -0.23853967
H  -1.09679907 -2.96137112 0.05574387
H  -1.41186937 -1.93140624 -1.33210243
O  -6.79134935 1.1636483 -0.82061049
H  -7.04021644 1.9815189 -1.26030315
C  -5.56808093 -1.40573187 -1.26746483
H  -5.0194327 -1.39449176 -2.21607884
H  -5.52017815 -2.41796107 -0.85884571
H  -6.61651704 -1.18832982 -1.48069227
C  -5.70080453 -0.59429516 1.07082749
H  -5.50304355 0.19060363 1.80066333
H  -6.7821998 -0.63981577 0.93056829
H  -5.37991912 -1.54611412 1.50359051
C  -0.39522835 -1.17741939 1.86446206
H  0.05274483 -2.15730096 2.0403017
H  0.19317927 -0.43789897 2.41178749
H  -1.37138202 -1.20444596 2.3411158
C  0.90265266 -0.93610577 -0.34940089
C  -0.26975246 1.64415578 0.60360548
H  -0.70262759 2.61685393 0.35985301
H  -0.18172051 1.61604323 1.69531645
C  1.78111055 0.21437766 0.24138149
H  1.82921753 0.06124936 1.32567032
C  1.13047127 1.57503144 -0.00568706
H  1.07737374 1.77259817 -1.08426112
H  1.72634066 2.39033235 0.42453069
C  0.77865662 -0.78813053 -1.88184662
H  1.7390706 -0.58033674 -2.36245712
H  0.42164072 -1.7172562 -2.33024373
H  0.10067834 0.00449856 -2.19513709
C  1.61731652 -2.28203036 -0.08734621
H  1.04405565 -3.09224772 -0.54611311
H  1.63900826 -2.4996112 0.98232691
C  3.23221458 0.12837059 -0.28623993
C  3.95035165 -1.23931838 -0.04661216
C  3.04893416 -2.33915462 -0.62192679
H  3.48877053 -3.31305783 -0.37877377
H  3.0521754 -2.27123243 -1.71594647
C  4.19392036 -1.48043879 1.45125587
H  3.26390794 -1.57057509 2.0135033
H  4.75082343 -2.41127509 1.59061736
H  4.77542883 -0.6811007 1.92346902
C  5.28813277 -1.18896712 -0.79847818
H  5.79367396 -2.15606749 -0.71228534
H  5.09102041 -1.04972836 -1.86884252
C  4.11797532 1.2083753 0.19217815
C  6.22773995 -0.10056503 -0.27668811
H  7.04953444 0.07964396 -0.97599481
H  6.69880779 -0.42906773 0.65524553
C  5.53348287 1.22112069 0.04449531
C  5.15761711 2.041816 -1.34045381
H  4.25658455 2.66635727 -1.35907502
H  5.99959812 2.73242342 -1.41709405
H  5.11385753 1.33338563 -2.16358218
C  6.31571116 2.13310164 0.97695869
H  6.41621023 1.66172641 1.95736561
H  7.32019379 2.30262818 0.58291953
H  5.82903353 3.10235488 1.11102629
H  3.17859982 0.24899166 -1.38083228
H  3.68007617 2.0633509 0.70876869
