program: Gaussian 09
title: 000037924
version: EM64L-G09RevD.01
frameworkgroup: C1[X(C12H6Cl2O2)]
method: RPBEPBE
basis: SDD
operation: Freq
keyword: #p
keyword: freq=noraman
keyword: PBEPBE/SDD
title: #p freq=noraman PBEPBE/SDD
converged: NO NO NO NO
title: Mulliken charges:
elementType: Cl Cl O O C C C C C C C C C C C C H H H H H H
charge: -0.015563 -0.015559 -0.263170 -0.263173 0.375832 0.375831 0.285319 0.285314 -0.311013 -0.311018 -0.380522 -0.380522 -0.251655 -0.251654 -0.209791 -0.209793 0.269178 0.269177 0.260096 0.260095 0.241295 0.241296
chargesum: 0.00000
title: Mulliken charges with hydrogens summed into heavy atoms:
elementType: Cl Cl O O C C C C C C C C C C C C
charge: -0.015563 -0.015559 -0.263170 -0.263173 0.375832 0.375831 0.285319 0.285314 -0.311013 -0.311018 -0.111345 -0.111345 0.008441 0.008441 0.031505 0.031503
polarizability: 2.26361701e+02 -1.18026549e+01 1.86529525e+02 3.66120717e-03 1.27140291e-02 5.62033880e+01
1716.lowfreq: -7.1031 -3.7014 0.0011 0.0012 0.0015 9.9829 40.2284 53.8158 125.2753
frequency: 40.2284 53.8158 125.2753 146.2846 159.8092 200.0639 236.9064 267.5650 285.8029 332.5808 346.2648 389.2012 407.0026 487.3469 510.9601 517.0483 518.8923 529.7540 532.0044 574.2092 638.9489 670.6287 673.1431 690.7137 765.7610 768.7823 783.5306 805.1478 879.8310 881.3438 882.2987 896.2985 956.1054 956.3501 1052.9230 1059.6042 1108.4703 1117.4178 1162.1443 1164.9168 1201.3843 1217.5785 1224.3024 1271.5108 1368.9242 1390.7889 1429.1709 1442.5550 1451.4072 1456.8009 1574.7028 1581.1762 1601.3374 1627.8114 3156.1079 3156.1884 3173.9400 3173.9822 3185.7956 3185.8177
redmass: 8.9606 9.0200 12.7180 9.6171 20.6373 4.8896 5.6141 6.1223 6.8832 7.8027 8.0082 10.4146 8.7365 6.9054 4.5309 4.6295 5.0153 4.8602 8.9503 13.3567 7.0831 4.5983 8.0175 4.3534 1.3009 1.3504 7.5218 6.4767 7.6089 1.3585 1.3600 10.3511 1.3048 1.3043 2.2022 1.9516 4.8412 5.4710 1.2446 1.2856 2.0888 1.6984 2.2261 2.9475 10.9933 7.2534 2.5097 3.0004 3.9585 3.3232 7.4441 7.7584 8.1368 9.0358 1.0871 1.0872 1.0927 1.0927 1.0996 1.0996
irintensity: 1.8766 1.9946 1.2810 0.0000 0.0000 0.9018 0.0000 0.0000 1.1474 0.7604 0.0000 7.5692 0.0000 0.0000 0.0076 0.0000 1.1894 0.0000 0.0000 0.0000 8.9424 21.7402 14.5069 0.0000 155.2815 0.0000 0.0000 35.5549 0.0000 0.0000 2.1218 219.6375 0.0001 3.1446 0.0000 27.7242 0.0000 17.5821 1.9908 0.0000 0.0000 12.1107 0.0000 392.4346 29.0902 0.0000 0.0000 398.5273 0.0000 242.9859 95.2225 0.0000 0.0000 14.9648 0.0083 10.5992 2.7309 0.0003 8.1153 0.0107
temp: 298.150 k
press: 1.00000 atm
elementType: 17 17 8 8 6 6 6 6 6 6 6 6 6 6 6 6 1 1 1 1 1 1
symmnumber: 1
zpe: 379495.3 jmol-1
zpe.correction: 0.144542 hartree
zpe.thermalcorrener: 0.157225 hartree
zpe.thermalcorrenthalpy: 0.158169 hartree
zpe.thermalcorrgfe: 0.104342 hartree
zpe.sumelectzpe: -1530.320527 hartree
zpe.sumelectthermal: -1530.307844 hartree
zpe.sumelectthermalent: -1530.306900 hartree
zpe.sumelectthermalfe: -1530.360727 hartree
dipole: 0.0000 0.0000 0.0002
dipole: 0.0002
quadrupole: -97.4473 -95.2318 -109.0226
quadrupole: -15.6338 -0.0017 0.0009
quadrupole: 3.1199 5.3354 -8.4554 -15.6338 -0.0017 0.0009
hfenergy: -1530.4650688 hartree
pointgroup: C01 [X(C12H6Cl2O2)]
dipole: 0.0000144 0.0000081 0.0000613 debye
dipolederiv: -0.1507696 -0.1600996 -0.0000187 -0.2572654 -0.6289198 -0.0000787 -0.0000325 -0.0000858 -0.0339851 -0.1507657 -0.1600996 -0.0000252 -0.2572648 -0.6289184 -0.0000952 -0.0000449 -0.000107 -0.0339814 -1.8745008 0.2451064 -0.0000023 0.3809173 -0.3703181 -0.0000261 0.0000009 -0.000039 -0.1321166 -1.8744901 0.2451006 -0.0000009 0.3809098 -0.3703154 -0.0000009 0.0000085 0.000012 -0.132118 0.7685129 -0.3245036 -0.0000452 -1.215975 0.064617 -0.000016 -0.000135 -0.0000097 0.1011212 0.7685052 -0.3245024 0.0000084 -1.2159662 0.0646124 -0.0000619 -0.0000647 -0.0000524 0.101122 1.4114516 -0.071379 0.0000477 0.5903158 0.0785628 0.0000106 0.0001244 0.000002 0.0776835 1.4114457 -0.0713801 -0.0000126 0.5903207 0.0785607 0.0000021 0.0000528 -0.0000069 0.0776822 0.1020215 0.2860943 0.0000244 0.4442015 0.9737449 0.0001598 0.0000576 0.000164 -0.0882369 0.1020186 0.2860941 0.0000421 0.4442016 0.9737434 0.000184 0.0000738 0.0001985 -0.0882387 -0.2807029 0.0211582 -0.0000036 0.1084637 0.0018247 0.0000139 -0.000009 0.0000185 -0.1663876 -0.2807025 0.021159 -0.0000113 0.1084627 0.0018273 0.0000125 -0.0000106 0.0000313 -0.1663873 -0.0952046 -0.0272086 -0.0000137 -0.0406462 -0.2661406 -0.0000346 -0.000022 -0.0000311 -0.1196959 -0.095201 -0.0272059 -0.0000068 -0.0406467 -0.2661387 -0.0000371 -0.0000114 -0.0000382 -0.1196959 0.0707197 0.039138 0.0000035 -0.0135027 0.0664591 0.0000213 -0.0000003 0.0000271 -0.1553517 0.0707185 0.0391415 -0.0000069 -0.0135014 0.0664574 0.0000223 -0.000013 0.0000162 -0.1553522 0.0901518 -0.0571084 -0.0000064 -0.0367011 0.0001441 -0.0000134 -0.0000049 -0.0000214 0.1801969 0.0901516 -0.0571103 -0.0000009 -0.0367015 0.0001432 -0.0000152 -0.0000005 -0.0000279 0.1801965 -0.0267488 -0.0354319 0.0000073 -0.0464697 0.0886262 -0.0000049 0.0000018 -0.0000101 0.1712493 -0.0267506 -0.0354322 -0.0000039 -0.0464706 0.0886256 -0.0000087 -0.0000101 -0.0000153 0.1712489 -0.0149307 0.0842351 0.0000086 0.0866599 -0.0085992 -0.0000149 0.0000161 -0.0000111 0.1655231 -0.0149298 0.0842344 0.0000162 0.0866585 -0.0085984 -0.0000189 0.0000231 -0.0000137 0.1655238 unknown
polarizability: 229.5900448|-0.5371347|183.3011815|0.000324|0.0132267|56.203388 unknown
InChI: InChI=1S/C12H6Cl2O2/c13-7-3-1-5-9-11(7)16-10-6-2-4-8(14)12(10)15-9/h1-6H
charge 0 multiplicity 1
22 atoms
Cl -3.140732 -2.511005 -0.000245
Cl 3.140738 2.510994 0.000465
O  -0.356643 -1.412981 -0.000164
O  0.356653 1.412973 0.000073
C  -1.337198 -0.392942 -0.000021
C  1.337209 0.392929 0.000065
C  0.997235 -0.983647 -0.000038
C  -0.997226 0.983637 0.000074
C  -2.696964 -0.754996 0.000006
C  2.696973 0.754991 0.000155
C  1.988985 -1.975752 -0.00006
C  -1.988977 1.975742 0.000182
C  -3.71072 0.226413 0.000162
C  3.710729 -0.226422 0.000068
C  3.349627 -1.591177 -0.000043
C  -3.34962 1.59117 0.00025
H  1.683302 -3.025404 -0.000138
H  -1.683288 3.025393 0.000267
H  -4.759475 -0.082269 0.000193
H  4.759484 0.082262 0.000104
H  4.130986 -2.356799 -0.000113
H  -4.130979 2.356791 0.000359
