program: Gaussian 09
title: 000037896
version: EM64L-G09RevD.01
frameworkgroup: C1[X(C14H18N2O3)]
method: RPBEPBE
basis: SDD
operation: Freq
keyword: #p
keyword: freq=noraman
keyword: PBEPBE/SDD
title: #p freq=noraman PBEPBE/SDD
converged: YES YES NO NO
title: Mulliken charges:
elementType: O O O N N C C C C C C C C C C C C C C H H H H H H H H H H H H H H H H H H
charge: -0.244090 -0.248972 -0.258519 -0.146704 -0.052259 -0.359521 -0.377927 -0.299939 -0.286052 0.208027 -0.366356 0.104581 0.320225 -0.358730 -0.352634 -0.802405 -0.240567 -0.227758 -0.235034 0.266017 0.228788 0.235675 0.227273 0.225693 0.202458 0.193546 0.223987 0.227193 0.231564 0.239984 0.265452 0.236096 0.302894 0.236356 0.226058 0.226022 0.229578
chargesum: 0.00000
title: Mulliken charges with hydrogens summed into heavy atoms:
elementType: O O O N N C C C C C C C C C C C C C C
charge: -0.244090 -0.248972 -0.258519 -0.146704 -0.052259 0.135283 0.085021 0.128212 0.131482 0.208027 0.092400 0.104581 0.320225 -0.118746 -0.087181 -0.027060 -0.014509 -0.001736 -0.005456
polarizability: 2.83324476e+02 4.41806786e+00 1.78437577e+02 5.96300725e+00 -6.43570881e+00 9.80674227e+01
1716.lowfreq: -6.2297 -3.2061 0.0001 0.0004 0.0008 9.8426 19.6266 21.5920 34.8200
frequency: 19.2453 21.4803 34.7645 38.9827 61.0245 84.6249 125.7624 129.1301 142.9549 162.5340 164.7343 212.1957 269.6278 276.9694 283.0567 325.8033 365.7989 378.3932 395.1718 402.2436 445.3620 446.7832 458.8172 482.4062 542.4187 563.4710 566.4516 615.2389 620.6118 641.5772 697.2111 756.7192 773.8079 778.3656 796.1264 830.8797 853.5508 888.5367 895.5051 929.9744 937.1916 982.3374 983.8645 989.4124 992.5196 1001.1233 1009.2778 1011.9488 1024.4109 1038.1997 1048.7284 1052.4121 1070.7292 1085.0372 1096.8299 1109.4497 1173.1600 1183.9627 1191.8467 1192.8009 1203.5992 1214.8701 1259.6623 1274.1123 1311.8684 1322.3897 1325.8630 1334.0802 1341.2466 1354.3504 1366.4401 1380.5656 1390.1775 1414.4564 1432.9690 1446.8110 1452.4468 1455.2694 1456.8115 1461.8893 1467.9170 1484.2633 1486.5747 1553.5499 1590.2024 1602.8043 1613.2667 2948.7966 2961.0558 2961.8188 2976.0953 2984.8575 2990.4372 3018.4016 3067.4573 3083.1011 3083.5535 3084.4460 3091.7141 3125.3205 3132.9096 3135.6523 3151.4863 3162.2444 3170.8074
redmass: 4.3821 3.9190 4.0890 4.8929 5.1550 5.2045 4.8335 4.4390 1.7510 1.3875 4.4993 2.6891 3.0648 3.9928 4.4704 3.5176 4.7200 5.9187 1.9761 2.8303 3.2997 3.2132 5.0823 4.6701 2.8325 3.3192 3.1237 6.3233 2.5475 4.7797 1.7718 4.8785 1.8033 4.2082 4.1315 1.6804 1.2509 9.4260 2.5953 1.4142 3.1367 2.4544 1.3758 5.3209 1.9179 1.3250 2.5334 3.1868 2.3653 1.5822 2.6163 2.8435 3.5866 1.7971 2.0096 2.2612 1.0546 2.9583 1.1223 1.0591 1.0800 1.6249 1.5935 1.1984 1.8365 1.8101 1.3822 1.4653 1.2329 1.3491 1.3031 5.7663 1.2640 2.6448 2.3204 1.0829 1.0805 1.1159 1.1424 1.1163 1.0884 1.0589 2.3099 4.8389 6.3864 9.1650 6.1143 1.0682 1.0648 1.0586 1.0666 1.0648 1.0390 1.1048 1.0972 1.0950 1.0958 1.0965 1.0987 1.0848 1.0970 1.0890 1.0931 1.0954 1.0997
irintensity: 0.1468 1.0043 0.1191 0.8761 5.6447 0.2562 0.9558 2.6743 4.1724 5.4258 5.2978 7.9174 5.4769 7.1999 5.7789 14.7181 1.0474 2.7085 1.8522 0.0212 1.6376 1.3948 8.3204 0.6684 15.6347 12.0104 22.9973 0.1361 4.3729 8.4328 50.7863 4.9072 55.1323 13.4779 16.5516 0.3629 0.0432 195.0679 3.7610 4.2847 11.6144 27.8378 0.1781 1.6306 0.4044 0.3995 105.5267 144.5816 9.3319 0.3713 42.0295 66.2413 36.1965 11.1624 12.0179 0.4505 0.3088 2.7249 2.5320 0.7608 1.5147 198.5371 69.5653 9.0095 16.6808 14.9576 3.0390 18.3424 4.4313 1.9690 0.8172 1.2901 35.8826 131.7372 14.8391 5.1537 14.7537 15.9528 1.5718 7.5065 19.5592 19.7601 10.9895 8.6942 4.4902 265.1020 3.9287 47.3799 69.0494 86.2074 36.7093 66.8315 14.1775 24.3998 13.4930 32.0094 15.7145 24.8012 33.9773 1.0099 3.7297 10.9023 28.3604 24.1597 13.6377
temp: 298.150 k
press: 1.00000 atm
elementType: 8 8 8 7 7 6 6 6 6 6 6 6 6 6 6 6 6 6 6 1 1 1 1 1 1 1 1 1 1 1 1 1 1 1 1 1 1
symmnumber: 1
zpe: 788232.4 jmol-1
zpe.correction: 0.300222 hartree
zpe.thermalcorrener: 0.318591 hartree
zpe.thermalcorrenthalpy: 0.319535 hartree
zpe.thermalcorrgfe: 0.250627 hartree
zpe.sumelectzpe: -877.970414 hartree
zpe.sumelectthermal: -877.952045 hartree
zpe.sumelectthermalent: -877.951101 hartree
zpe.sumelectthermalfe: -878.020008 hartree
dipole: 0.5351 2.4703 -0.2104
dipole: 2.5364
quadrupole: -101.8460 -109.8211 -113.6859
quadrupole: -3.0863 2.3512 -1.7484
quadrupole: 6.6050 -1.3701 -5.2349 -3.0863 2.3512 -1.7484
hfenergy: -878.2706354 hartree
pointgroup: C01 [X(C14H18N2O3)]
dipole: -0.2211481 -0.9684893 -0.0942497 debye
polarizability: 283.499264|3.1802424|178.2112152|-4.2963871|7.3274867|98.1189967 unknown
InChI: InChI=1S/C14H18N2O3/c1-12(13-5-3-2-4-6-13)15-19-11-14(17)16-7-9-18-10-8-16/h2-6H,7-11H2,1H3
charge 0 multiplicity 1
37 atoms
O  6.035932 -1.270626 0.404591
O  0.018746 0.893644 -0.086892
O  2.418828 2.059698 -0.002843
N  3.615596 0.092264 -0.343834
N  -1.203623 0.083274 -0.110108
C  4.908545 0.81453 -0.343299
C  3.744182 -1.364304 -0.558366
C  5.863509 0.171223 0.676919
C  4.738184 -1.956704 0.466937
C  2.429569 0.806925 -0.181146
C  1.140153 -0.033074 -0.231247
C  -2.281722 0.840601 0.02124
C  -3.585214 0.114314 0.010537
C  -4.807393 0.826736 0.154962
C  -3.640796 -1.302523 -0.143058
C  -2.247786 2.347215 0.176338
C  -6.045918 0.147546 0.147057
C  -4.876232 -1.976559 -0.15058
C  -6.087797 -1.255882 -0.005436
H  4.703633 1.870247 -0.098261
H  5.355947 0.760498 -1.356091
H  4.127251 -1.550708 -1.582668
H  2.768763 -1.867868 -0.461439
H  6.874172 0.604097 0.603323
H  5.471346 0.313283 1.706713
H  4.313147 -1.872783 1.491336
H  4.95155 -3.014554 0.241156
H  1.115935 -0.77636 0.590719
H  1.055618 -0.575999 -1.193993
H  -4.797722 1.914737 0.274359
H  -2.703008 -1.854625 -0.255017
H  -2.720552 2.648768 1.129187
H  -1.212772 2.716123 0.163202
H  -2.809719 2.83377 -0.64204
H  -6.97645 0.715013 0.259992
H  -4.899996 -3.065766 -0.26955
H  -7.048406 -1.782873 -0.011602
