program: Gaussian 09
title: 000037888
version: EM64L-G09RevD.01
frameworkgroup: C1[X(C16H21NO3)]
method: RPBEPBE
basis: SDD
operation: Freq
keyword: #p
keyword: freq=noraman
keyword: PBEPBE/SDD
title: #p freq=noraman PBEPBE/SDD
converged: YES YES NO NO
title: Mulliken charges:
elementType: O O O N C C C C C C C C C C C C C C C C H H H H H H H H H H H H H H H H H H H H H
charge: -0.272611 -0.249899 -0.259957 -0.082091 0.225398 0.065858 -0.482072 0.227384 0.207947 0.025347 0.102276 -0.412273 -0.389371 0.252823 -0.614392 -0.618448 -0.824634 -0.805321 -0.239106 -0.686836 0.224932 0.214037 0.279767 0.248681 0.242632 0.181779 0.216187 0.184211 0.228280 0.221012 0.224796 0.225390 0.285195 0.249960 0.249027 0.254408 0.214433 0.208557 0.209011 0.229284 0.238398
chargesum: 0.00000
title: Mulliken charges with hydrogens summed into heavy atoms:
elementType: O O O N C C C C C C C C C C C C C C C C
charge: -0.272611 -0.249899 -0.259957 -0.082091 0.225398 0.065858 -0.043103 0.227384 0.207947 0.025347 0.102276 -0.132506 -0.140690 0.252823 0.026208 0.015055 -0.089254 -0.051926 0.183884 -0.010143
polarizability: 2.78561705e+02 -2.15739433e+00 2.11914446e+02 -5.02920810e+00 -1.36457384e+01 1.17666919e+02
1716.lowfreq: -8.6219 -4.0401 -0.0013 -0.0009 -0.0005 5.5588 34.2747 39.1784 45.8790
frequency: 34.1725 39.0893 45.8536 49.4549 59.8513 82.5159 95.1118 109.9335 116.9415 130.7438 135.9035 184.2050 196.9035 232.4813 243.0604 250.1825 264.9387 280.3477 282.8102 288.2487 302.2165 315.1904 341.6441 351.6910 368.7183 403.5221 434.8977 445.4433 492.1194 512.1489 548.7251 567.8450 587.4886 613.1009 635.3991 669.8088 725.2245 731.3476 775.2239 811.5018 815.7686 818.9151 839.9649 850.1525 913.1580 937.6342 976.2850 985.9538 1013.2951 1023.6422 1031.1945 1032.5147 1037.7275 1054.5935 1069.8758 1088.8757 1115.4250 1128.5325 1132.1921 1132.7323 1163.8893 1173.9717 1181.2411 1205.9316 1244.7974 1247.9997 1253.8441 1261.3481 1285.4698 1352.4399 1363.3581 1366.2443 1389.1552 1390.1341 1398.6449 1405.5415 1416.8270 1431.3328 1441.2279 1451.4625 1458.3787 1459.0988 1460.0386 1460.8467 1470.2491 1472.2685 1473.3766 1474.4188 1482.5794 1485.6189 1492.7902 1494.4719 1543.7114 1576.0577 1614.9476 1636.2158 2836.9220 2851.5031 2893.9744 2960.2699 2979.9821 2989.8050 2997.5284 3014.6369 3022.0451 3024.7667 3042.3924 3061.0515 3064.5096 3074.8042 3085.1358 3093.7888 3095.0620 3107.4082 3128.3942 3152.3675 3174.0153
redmass: 3.4931 2.6687 3.3654 3.6066 1.0930 2.8497 2.8824 3.0409 1.3912 2.4497 2.9701 4.2091 2.8186 1.3170 1.1850 1.1157 3.8207 3.0088 5.9490 2.6164 2.8344 3.7184 4.5688 4.0475 2.4894 2.9114 2.8578 4.6038 5.9389 4.1873 4.5103 4.8175 4.9252 5.6753 5.7335 4.7066 4.6425 5.5439 4.3146 4.0910 1.3765 4.8819 1.3835 3.5711 2.2951 3.0012 1.3350 1.8627 2.1742 2.2516 1.9734 1.4188 1.8497 1.5384 3.1278 1.2597 2.1704 2.1957 1.5285 1.5017 3.4193 1.8933 1.8203 3.1786 2.9931 4.5211 2.7146 1.1494 1.5819 2.3183 1.6041 1.4581 2.7996 1.5451 1.3615 1.3454 1.1608 4.1836 1.1845 1.1077 1.0460 1.0528 1.0644 1.0620 1.3218 1.0688 1.0517 1.0816 1.2237 1.0914 1.5465 1.0470 10.5736 8.8527 7.4799 7.8156 1.0577 1.0580 1.0694 1.0556 1.0368 1.0390 1.0361 1.0707 1.1074 1.0720 1.0886 1.0986 1.0973 1.1009 1.1001 1.0979 1.0989 1.1015 1.0971 1.0880 1.0956
irintensity: 2.2092 0.8173 0.0582 0.1799 0.1112 6.8232 0.8352 1.7720 0.0801 1.4124 2.0000 0.9469 1.1928 0.4806 0.4730 1.0624 0.9329 4.5958 0.1075 1.0905 2.4010 1.3062 9.7597 1.4366 2.8799 0.5137 1.6038 4.4672 7.7666 2.9286 7.1855 6.3558 5.4920 0.8940 3.4767 13.2298 14.1945 5.9275 21.4838 3.6439 14.8334 20.2553 8.3788 2.9895 17.5800 1.0785 1.2459 10.2272 46.6108 4.9544 21.4011 4.7620 11.5343 0.5713 313.1358 7.8927 12.9871 20.6485 15.9755 8.3180 149.5235 31.1391 1.2896 3.3508 187.1528 51.3707 2.9142 0.4878 18.6976 150.3982 28.1301 27.6510 70.6484 14.6512 82.4979 70.1143 2.5256 23.4465 3.1153 6.9405 22.3035 5.5417 9.4171 15.0470 9.8864 36.2812 16.3677 28.3713 6.8325 12.8035 1.2496 9.0257 181.7766 38.4079 180.2928 160.9728 95.8058 160.3001 91.1536 42.9604 42.1724 13.5618 24.4792 43.0615 25.6398 47.2000 9.1314 25.5714 6.6599 30.5077 45.3017 2.1202 29.8084 31.9808 11.3351 0.7592 14.5559
temp: 298.150 k
press: 1.00000 atm
elementType: 8 8 8 7 6 6 6 6 6 6 6 6 6 6 6 6 6 6 6 6 1 1 1 1 1 1 1 1 1 1 1 1 1 1 1 1 1 1 1 1 1
symmnumber: 1
zpe: 884547.1 jmol-1
zpe.correction: 0.336906 hartree
zpe.thermalcorrener: 0.358273 hartree
zpe.thermalcorrenthalpy: 0.359217 hartree
zpe.thermalcorrgfe: 0.285993 hartree
zpe.sumelectzpe: -901.198886 hartree
zpe.sumelectthermal: -901.177519 hartree
zpe.sumelectthermalent: -901.176575 hartree
zpe.sumelectthermalfe: -901.249799 hartree
dipole: 2.8734 2.6255 -0.9881
dipole: 4.0157
quadrupole: -107.6932 -116.1433 -120.6885
quadrupole: -22.9161 2.6633 0.5746
quadrupole: 7.1485 -1.3016 -5.8468 -22.9161 2.6633 0.5746
hfenergy: -901.535792 hartree
pointgroup: C01 [X(C16H21N1O3)]
dipole: 1.1934594 -0.9803909 0.3326079 debye
polarizability: 276.3073822|6.6805823|214.5114879|16.8342909|0.3193128|117.3242005 unknown
InChI: InChI=1S/C16H21NO3/c1-6-19-14-8-7-12-15(18)10(2)11(3)20-16(12)13(14)9-17(4)5/h7-8H,6,9H2,1-5H3
charge 0 multiplicity 1
41 atoms
O  -1.25695 -1.305035 0.312299
O  2.958601 0.909815 0.719588
O  -3.315393 2.265337 -0.32318
N  2.233644 -2.010089 -0.560386
C  0.862363 -0.191495 0.473137
C  -0.535699 -0.094285 0.284871
C  1.572991 -1.517815 0.680796
C  -1.216708 1.13467 0.072108
C  1.590686 1.030929 0.472734
C  -2.683744 1.169967 -0.126955
C  -3.374263 -0.141019 -0.084889
C  -0.443967 2.321536 0.056661
C  0.941984 2.282861 0.256988
C  -2.651894 -1.296037 0.128674
C  1.28019 -2.418804 -1.60857
C  3.233856 -3.05365 -0.26832
C  -4.877036 -0.150054 -0.282298
C  -3.182779 -2.699495 0.204664
C  3.795913 2.128276 0.680967
C  5.230154 1.679441 0.94519
H  2.370024 -1.367835 1.430389
H  0.851402 -2.266635 1.086776
H  -0.97315 3.264936 -0.111764
H  1.514406 3.213871 0.250841
H  0.619091 -1.574079 -1.865881
H  0.632179 -3.282304 -1.307389
H  1.837814 -2.705378 -2.518569
H  2.797081 -3.985585 0.176676
H  3.987312 -2.658159 0.436443
H  3.7534 -3.337995 -1.201265
H  -5.410183 -0.569694 0.590537
H  -5.176496 -0.72975 -1.174968
H  -5.208877 0.892234 -0.421436
H  -2.962803 -3.143718 1.193057
H  -2.696378 -3.338946 -0.554869
H  -4.269987 -2.721056 0.042263
H  3.69898 2.604998 -0.31508
H  3.446072 2.841855 1.454826
H  5.910167 2.550253 0.918384
H  5.313828 1.200971 1.935888
H  5.555369 0.955163 0.179462
