program: Gaussian 09
title: 000037879
version: EM64L-G09RevD.01
frameworkgroup: C1[X(C7H6ClNO2)]
method: RPBEPBE
basis: SDD
operation: Freq
keyword: #p
keyword: freq=noraman
keyword: PBEPBE/SDD
title: #p freq=noraman PBEPBE/SDD
converged: YES YES NO YES
title: Mulliken charges:
elementType: Cl O O N C C C C C C C H H H H H H
charge: -0.008475 -0.457158 -0.222940 -0.702727 0.408647 0.549367 -0.520075 -0.349045 -0.414330 -0.164354 0.107625 0.280053 0.228772 0.253810 0.310854 0.314596 0.385381
chargesum: 0.00000
title: Mulliken charges with hydrogens summed into heavy atoms:
elementType: Cl O O N C C C C C C C
charge: -0.008475 -0.071776 -0.222940 -0.077278 0.408647 0.549367 -0.240022 -0.349045 -0.185558 0.089456 0.107625
polarizability: 1.47589129e+02 -3.94874990e+00 1.15752404e+02 4.74473488e-03 -8.47926803e-03 3.91984590e+01
1716.lowfreq: -8.0153 -0.0026 -0.0026 -0.0019 3.1115 7.2048 25.3583 98.4298 158.3266
frequency: 25.3278 98.4291 158.3264 183.3068 236.5594 311.3271 335.3289 368.5985 373.4392 393.9709 405.9298 427.3750 499.8417 530.4693 596.4302 605.9043 640.3714 691.4743 707.0244 754.7233 820.1576 907.6739 912.2305 947.2701 984.3620 1033.4660 1051.8854 1137.4266 1158.5609 1258.7746 1286.8967 1335.3986 1392.6883 1420.9014 1480.1887 1576.7542 1623.1990 1646.6392 1655.3206 3132.7931 3167.9949 3170.7682 3534.4003 3569.5695 3709.1363
redmass: 13.2294 5.1561 4.8592 9.5802 6.4146 4.7569 15.4293 1.1019 4.1413 1.2130 8.3603 2.7210 4.6372 2.6325 1.3776 4.9676 7.0610 3.3153 6.0565 5.2836 1.4675 1.6791 4.5841 1.3546 4.4169 2.3041 2.1363 1.6527 1.2768 1.4806 1.9250 2.9263 8.4856 3.5118 3.4684 7.4138 4.1414 1.3494 6.5148 1.0897 1.0936 1.0934 1.0641 1.0452 1.1041
irintensity: 0.6219 0.1808 4.6757 0.6250 1.1021 1.5274 1.8381 82.2364 2.3823 238.1088 5.2815 15.8796 13.0724 1.8975 158.1649 44.3804 25.7953 10.4687 3.3627 14.1621 44.8482 30.5257 24.5245 0.1941 193.5914 53.3097 21.7643 105.1338 55.9490 3.6223 43.1103 74.2447 8.5805 18.1111 148.6875 33.3445 88.4327 353.3788 94.5571 14.2214 2.8360 7.9247 42.6784 81.8515 24.2201
temp: 298.150 k
press: 1.00000 atm
elementType: 17 8 8 7 6 6 6 6 6 6 6 1 1 1 1 1 1
symmnumber: 1
zpe: 312575.9 jmol-1
zpe.correction: 0.119054 hartree
zpe.thermalcorrener: 0.129232 hartree
zpe.thermalcorrenthalpy: 0.130176 hartree
zpe.thermalcorrgfe: 0.082408 hartree
zpe.sumelectzpe: -934.822481 hartree
zpe.sumelectthermal: -934.812304 hartree
zpe.sumelectthermalent: -934.811359 hartree
zpe.sumelectthermalfe: -934.859127 hartree
dipole: -5.8623 1.1980 0.0017
dipole: 5.9834
quadrupole: -60.2994 -58.3851 -73.7744
quadrupole: 3.0283 -0.0189 0.0031
quadrupole: 3.8536 5.7678 -9.6214 3.0283 -0.0189 0.0031
hfenergy: -934.9415352 hartree
pointgroup: C01 [X(C7H6Cl1N1O2)]
dipole: -2.0427183 1.1695912 0.030736 debye
dipolederiv: -0.3504389 0.3576467 -0.0013745 0.3306809 -0.4706115 0.0039791 -0.000327 0.0028743 -0.0312246 -0.3349844 -0.1396875 0.0018557 -0.2675155 -1.3150428 0.0418701 0.006649 0.0373625 -0.4356522 -1.0668179 0.0719421 0.0233112 -0.0130596 -0.5563059 0.0096147 0.0264793 0.0067246 -0.3124652 -1.0466967 0.7089852 -0.0154499 0.7794373 -0.6249507 -0.0320438 -0.0184783 -0.0292581 -0.7553748 -0.5953427 -0.3675792 0.0375328 -0.18486 -0.0488817 0.0116092 0.0310327 0.0179511 0.0919217 1.0363528 -0.974217 0.0039768 -0.9648481 0.4290751 0.0242724 0.0035125 0.024742 0.1563789 -0.2176023 0.5549899 -0.0197381 -0.1511826 -0.0827926 0.0006521 0.0058949 -0.0242697 -0.2089063 0.453281 -0.6581005 0.0024517 -0.2568322 0.4561142 -0.0118646 -0.0122132 0.002393 -0.1360501 -0.0160771 -0.0300522 -0.0058767 0.4153735 -0.0766984 -0.01963 -0.0217737 -0.0038514 -0.2117721 -0.0490839 0.2626064 -0.0100649 0.0231578 0.0062942 -0.0035449 -0.0014444 -0.0120696 -0.0677553 1.6244702 0.3370487 -0.0604792 0.3523067 1.6029355 -0.0631289 -0.0612717 -0.0624159 0.2313347 0.1176768 0.0409409 0.0004971 0.025987 -0.0204986 0.0060792 0.0009545 0.0055744 0.1728166 -0.1183935 -0.0484443 0.0118704 -0.0328365 0.0631662 0.0049195 0.0113049 0.0054637 0.1665196 0.0932926 -0.0111304 0.002675 -0.0313444 -0.0478978 0.008504 0.0034126 0.0077378 0.1572598 0.2112778 -0.0494287 0.0083298 -0.0321759 0.131773 0.0105236 0.0079361 0.0110753 0.3928693 0.1566253 -0.0454982 0.0100072 -0.0712585 0.1899384 0.0096855 0.0112094 0.0084946 0.3923299 0.1024612 -0.0100219 0.0104756 0.0789701 0.3643834 -0.0014972 0.0071225 0.0014716 0.39777 unknown
polarizability: 142.0170472|-12.7350909|121.1227734|-3.1674709|-2.5002553|39.4001723 unknown
InChI: InChI=1S/C7H6ClNO2/c8-6-2-1-4(9)3-5(6)7(10)11/h1-3,10H,9H2
charge 0 multiplicity 1
17 atoms
Cl 1.581538 -2.521273 -0.01625
O  1.815412 2.133011 -0.192026
O  2.96237 0.12408 -0.157477
N  -3.035298 1.399858 0.006538
C  0.495389 0.126514 -0.072592
C  -1.955658 0.518627 0.000001
C  -0.623685 1.001948 -0.064761
C  0.258112 -1.275511 -0.013667
C  -2.159888 -0.891105 0.058144
C  -1.061901 -1.768179 0.050844
C  1.862129 0.719251 -0.141569
H  -0.427702 2.076607 -0.11071
H  -3.176296 -1.298738 0.108827
H  -1.22537 -2.848955 0.095509
H  -3.989633 1.05617 0.053125
H  -2.88805 2.403887 -0.034011
H  2.752233 2.463608 -0.236127
