program: Gaussian 09
title: 000037868
version: EM64L-G09RevD.01
frameworkgroup: C1[X(C10H14N2O2)]
method: RPBEPBE
basis: SDD
operation: Freq
keyword: #p
keyword: freq=noraman
keyword: PBEPBE/SDD
title: #p freq=noraman PBEPBE/SDD
converged: YES YES NO NO
title: Mulliken charges:
elementType: O O N N C C C C C C C C C C H H H H H H H H H H H H H H
charge: -0.313021 -0.256450 -0.287801 -0.384923 -0.489859 0.436973 -0.359911 -0.447074 -0.221121 -0.218371 -0.240565 -0.217408 0.324963 -0.674176 0.240824 0.199131 0.285302 0.230506 0.287226 0.227599 0.224760 0.227796 0.306742 0.226191 0.226113 0.210851 0.227559 0.228142
chargesum: 0.00000
title: Mulliken charges with hydrogens summed into heavy atoms:
elementType: O O N N C C C C C C C C C C
charge: -0.313021 -0.256450 -0.000575 -0.078181 -0.049905 0.436973 -0.074609 -0.216568 0.006479 0.006390 -0.012769 0.234897 0.324963 -0.007624
polarizability: 1.85802395e+02 1.80596374e+00 1.25919317e+02 3.85244702e+00 2.93364471e+00 7.23704932e+01
1716.lowfreq: -1.5035 0.0004 0.0005 0.0007 3.3162 9.7451 17.1894 30.7662 40.7656
frequency: 16.6857 30.6831 40.7528 66.5007 73.2309 116.3064 123.2045 165.7572 247.6426 248.8981 277.5199 305.0696 340.8578 358.9145 407.1566 454.2611 488.8421 531.6760 601.9854 611.5448 620.8708 693.9657 705.6311 712.3690 750.3518 801.8582 817.5411 853.7693 859.4503 919.1386 947.9528 977.1162 983.0514 989.7704 1000.2343 1026.3584 1037.9828 1069.4596 1085.0320 1108.4367 1139.4673 1141.0934 1171.5649 1184.1314 1198.0649 1212.3966 1249.0510 1255.0226 1311.6445 1343.6985 1357.9882 1386.9783 1398.9473 1436.4978 1440.9374 1462.5636 1477.8789 1478.4982 1485.7930 1490.9103 1510.8970 1594.9523 1614.7617 1689.7114 2888.9750 2994.6095 3006.0164 3010.4575 3063.2535 3091.7112 3105.0292 3113.7252 3125.5282 3138.1631 3150.2054 3163.2800 3433.5847 3489.6934
redmass: 4.8653 3.7079 3.1008 5.1989 2.8595 3.4471 4.1676 3.4721 1.2785 3.0701 3.9431 2.9417 3.7382 3.4229 2.8402 2.2737 4.6416 2.0755 1.2140 5.6465 5.2289 6.8100 2.0896 5.5621 1.5504 1.0958 3.8577 3.4478 1.2475 1.3445 5.5446 1.8985 1.4140 5.9705 1.3500 2.1678 2.6699 3.1134 1.6835 2.3685 1.4589 4.1375 1.0558 1.1133 1.3145 2.5172 1.1338 2.3281 1.3751 1.3921 1.3280 6.0289 1.2646 1.3107 2.1105 1.0407 1.0666 1.4152 1.5622 1.0839 1.4274 6.1470 6.0658 9.6967 1.0709 1.0357 1.0581 1.0885 1.1068 1.0985 1.1024 1.0871 1.0867 1.0917 1.0959 1.1014 1.0762 1.0770
irintensity: 1.2819 0.5461 0.5419 2.3577 4.5677 2.0085 3.6068 7.0991 0.3884 5.1224 1.7689 12.7499 20.1430 4.7664 0.2187 23.2023 5.5853 78.5292 116.2050 0.2803 2.1913 11.3435 41.1546 19.3168 62.2341 4.1412 4.3701 0.9565 0.0776 3.7658 61.6548 16.5464 1.5170 0.1950 1.0792 11.2598 94.0746 11.2979 23.7691 67.6705 5.0040 494.6185 0.2261 0.2803 29.4814 2.0953 0.0643 24.5247 2.5058 1.2514 1.5572 1.0800 25.3724 32.5751 15.9522 11.6131 6.0693 14.5809 12.0626 12.9069 83.8734 0.4063 3.3829 236.4044 88.5812 23.7349 25.1714 16.7789 10.8591 33.0503 49.1705 8.7514 1.2712 23.6704 24.3011 24.3713 31.7756 1.7295
temp: 298.150 k
press: 1.00000 atm
elementType: 8 8 7 7 6 6 6 6 6 6 6 6 6 6 1 1 1 1 1 1 1 1 1 1 1 1 1 1
symmnumber: 1
zpe: 599780.8 jmol-1
zpe.correction: 0.228444 hartree
zpe.thermalcorrener: 0.242871 hartree
zpe.thermalcorrenthalpy: 0.243815 hartree
zpe.thermalcorrgfe: 0.184180 hartree
zpe.sumelectzpe: -648.329583 hartree
zpe.sumelectthermal: -648.315156 hartree
zpe.sumelectthermalent: -648.314212 hartree
zpe.sumelectthermalfe: -648.373848 hartree
dipole: -0.4584 -2.8239 0.4103
dipole: 2.8901
quadrupole: -66.8217 -79.7619 -83.4371
quadrupole: 0.4662 1.8381 -0.4643
quadrupole: 9.8519 -3.0884 -6.7635 0.4662 1.8381 -0.4643
hfenergy: -648.5580275 hartree
pointgroup: C01 [X(C10H14N2O2)]
dipole: -0.203223 1.1164219 -0.0722821 debye
polarizability: 185.7548368|-0.230147|125.0996522|-5.1334964|6.9912103|73.2377165 unknown
InChI: InChI=1S/C10H14N2O2/c1-2-14-10(13)12-11-8-9-6-4-3-5-7-9/h3-7,11-12H,2,8H2,1H3
charge 0 multiplicity 1
28 atoms
O  -3.711648 0.327455 -0.012885
O  -2.123487 -1.419988 -0.073679
N  -0.199639 0.638531 -0.663616
N  -1.568063 0.850903 -0.492955
C  0.699454 1.098262 0.415851
C  2.090562 0.502633 0.234756
C  2.23755 -0.880565 -0.046875
C  3.247807 1.307563 0.369695
C  3.524029 -1.446345 -0.181281
C  4.537174 0.740111 0.239947
C  4.678073 -0.639054 -0.03563
C  -4.766797 -0.673077 0.306409
C  -2.415315 -0.209091 -0.184305
C  -6.072057 0.101275 0.464098
H  0.255924 0.744642 1.366636
H  0.773954 2.210183 0.484443
H  1.33555 -1.491667 -0.164133
H  3.14198 2.379757 0.578639
H  0.131187 0.790195 -1.621597
H  3.628471 -2.515856 -0.396669
H  5.426047 1.371926 0.348706
H  5.675865 -1.080385 -0.139291
H  -1.978102 1.793184 -0.491602
H  -4.81283 -1.411377 -0.514905
H  -4.479791 -1.20664 1.230839
H  -6.894505 -0.597446 0.703115
H  -5.995951 0.840474 1.280009
H  -6.329042 0.634795 -0.467123
