program: Gaussian 09
title: 000037867
version: EM64L-G09RevD.01
frameworkgroup: C1[X(C14H19N7O2)]
method: RPBEPBE
basis: SDD
operation: Freq
keyword: #p
keyword: freq=noraman
keyword: PBEPBE/SDD
title: #p freq=noraman PBEPBE/SDD
converged: YES YES NO NO
title: Mulliken charges:
elementType: O O N N N N N N N C C C C C C C C C C C C C C H H H H H H H H H H H H H H H H H H H
charge: -0.259919 -0.321280 -0.154479 -0.413212 -0.128621 -0.617718 -0.134298 -0.655665 -0.651958 -0.274320 -0.445549 -0.544857 0.155742 0.133412 0.375479 -0.427130 -0.453698 0.253555 -0.594157 0.027396 -0.136627 -0.366734 0.393595 0.250239 0.238234 0.247640 0.243125 0.235776 0.348621 0.256165 0.329560 0.318072 0.321356 0.255619 0.255944 0.198849 0.207469 0.246340 0.329849 0.311123 0.310251 0.336811
chargesum: 0.00000
title: Mulliken charges with hydrogens summed into heavy atoms:
elementType: O O N N N N N N N C C C C C C C C C C C C C C
charge: -0.259919 -0.321280 -0.154479 -0.064591 -0.128621 0.021711 -0.134298 -0.014694 -0.004896 -0.024081 0.040325 -0.065956 0.155742 0.133412 0.375479 -0.170965 -0.124138 0.253555 0.116255 0.027396 0.070842 -0.120394 0.393595
polarizability: 4.38093740e+02 5.36718119e+01 2.60340590e+02 1.61402611e+00 4.21123332e+00 1.11331290e+02
1716.lowfreq: -1.9463 -0.0006 0.0007 0.0009 4.6045 5.4638 17.2403 24.5626 32.0833
frequency: 17.0460 24.5164 32.0790 37.8158 47.3214 62.9389 74.1184 84.6122 91.5571 98.3390 114.5201 155.9256 162.0913 197.9309 206.6592 220.9692 231.9257 241.3458 262.9514 284.7447 303.2876 347.0012 367.9859 374.2721 386.2747 407.8689 414.3066 441.8817 462.0222 468.7684 485.0912 494.8552 505.7642 515.6008 531.7396 566.5299 579.7393 605.9184 618.9299 632.1316 641.0198 658.5788 699.6256 728.0993 733.1711 755.4538 778.6943 805.0318 816.7186 825.8748 828.4131 868.7510 882.4518 885.1146 951.0848 961.6474 977.7591 991.2953 1005.2163 1016.8325 1025.2467 1049.3179 1052.9187 1063.1852 1081.6514 1110.6867 1119.7852 1132.7071 1137.4153 1185.3881 1199.0646 1215.9531 1220.8013 1241.5013 1246.0097 1257.4145 1265.6326 1283.1166 1307.1499 1343.1657 1364.9186 1387.9935 1397.9025 1407.7451 1426.5588 1449.3903 1454.7218 1462.8608 1474.6002 1474.7852 1485.5413 1503.2728 1535.3234 1558.8051 1590.2451 1604.9667 1615.8970 1619.0377 1621.6893 1653.3257 1655.3143 2939.9546 2963.8951 2989.1976 3005.1361 3034.6872 3053.6757 3106.4390 3108.5774 3109.1620 3154.5376 3214.4396 3278.0188 3373.8711 3537.3056 3541.4191 3554.0502 3682.0624 3688.8864 3704.6223
redmass: 4.8965 4.1836 5.6121 4.7300 4.2356 4.4510 5.6127 3.6646 1.3959 2.8778 3.4067 4.5892 3.6866 3.5817 3.4086 3.3451 3.9696 4.6042 4.3807 5.8544 5.2456 3.0910 3.5762 1.4361 1.4796 5.6876 2.0602 1.3144 2.6924 1.8931 1.3498 2.4913 3.2691 3.5860 1.1143 1.7397 3.7544 5.1547 3.9534 2.4614 4.6204 5.3462 3.2729 4.5279 3.6462 2.5454 4.4751 2.9978 1.7638 1.7467 1.3829 3.1107 2.2644 1.3990 3.6502 3.5959 2.7345 1.5095 2.8583 6.0119 2.1213 2.2948 1.3904 1.6586 1.5685 2.0405 1.3134 1.4568 1.5278 2.0842 1.3542 1.8692 2.1333 1.5925 1.5936 1.2618 1.4053 1.5473 1.4490 2.9403 3.8159 4.5381 4.7467 5.3876 3.2369 1.0427 1.0907 1.7522 3.2074 1.1205 1.2342 2.1153 7.0392 4.4195 5.3432 1.4096 6.5899 1.4743 1.8391 1.9411 3.1962 1.0844 1.0831 1.0615 1.0332 1.0682 1.0953 1.1016 1.1023 1.1041 1.0907 1.0978 1.0984 1.0775 1.0456 1.0462 1.0454 1.1029 1.1030 1.1039
irintensity: 9.8526 1.9328 3.5685 0.0461 9.2836 0.2253 1.3749 0.9630 0.0427 0.8311 5.9851 1.2795 0.5180 6.3466 1.4550 10.9181 4.6692 1.1275 3.7254 8.5709 2.8205 23.6653 19.1938 134.0595 262.8257 33.0636 126.9114 126.8668 52.2258 66.3622 168.4640 8.2325 5.8955 15.4493 351.6624 42.2538 4.4353 17.1523 23.6290 6.7681 30.5079 23.5200 12.3889 14.9256 4.9501 30.4327 10.8164 18.8696 51.6371 49.7938 52.3525 4.2391 0.9134 42.6044 19.9617 4.8953 19.4881 24.5231 5.4962 368.6683 24.1953 10.4773 15.4388 4.3078 22.9105 8.5558 1.6086 68.9475 54.7690 132.7617 2.2996 150.1765 16.5090 2.9665 58.0868 3.4616 9.6155 31.0992 16.2352 640.7262 32.2476 367.9858 33.0877 19.3521 309.4279 11.4871 21.1930 36.9490 144.9996 17.4255 29.6600 671.5786 631.0273 119.7492 130.2906 34.6617 69.4250 500.9585 400.4889 1078.7317 80.8200 42.4734 28.2918 44.6392 57.1814 9.6185 24.4590 14.6761 20.8570 25.5061 8.1902 0.6343 6.2760 259.5675 41.3380 88.0406 58.8987 20.1795 23.0734 34.9336
temp: 298.150 k
press: 1.00000 atm
elementType: 8 8 7 7 7 7 7 7 7 6 6 6 6 6 6 6 6 6 6 6 6 6 6 1 1 1 1 1 1 1 1 1 1 1 1 1 1 1 1 1 1 1
symmnumber: 1
zpe: 875027.4 jmol-1
zpe.correction: 0.333280 hartree
zpe.thermalcorrener: 0.356866 hartree
zpe.thermalcorrenthalpy: 0.357810 hartree
zpe.thermalcorrgfe: 0.277309 hartree
zpe.sumelectzpe: -1076.911006 hartree
zpe.sumelectthermal: -1076.887421 hartree
zpe.sumelectthermalent: -1076.886477 hartree
zpe.sumelectthermalfe: -1076.966977 hartree
dipole: -0.0801 -1.0841 1.4336
dipole: 1.7991
quadrupole: -15.7140 -114.7563 -138.7885
quadrupole: 27.9519 11.6410 -0.6312
quadrupole: 74.0389 -25.0033 -49.0356 27.9519 11.6410 -0.6312
hfenergy: -1077.2442864 hartree
pointgroup: C01 [X(C14H19N7O2)]
dipole: -0.0223643 0.6565516 0.2635268 debye
polarizability: 428.0769145|62.7290777|226.4308313|-26.2483688|-70.8039837|155.2578743 unknown
InChI: InChI=1S/C14H19N7O2/c1-21-7-8(19-13(22)9-2-3-12(17)20-9)6-10(21)14(23)18-5-4-11(15)16/h4-7,9,19H,2-3,15-17H2,1H3
charge 0 multiplicity 1
42 atoms
O  -1.891522 1.170007 -1.441742
O  3.520307 -1.653108 1.278587
N  -4.944908 -0.656403 -0.423775
N  -2.310718 -0.80798 -0.224833
N  0.655828 -2.325368 1.207479
N  -6.994693 -0.683401 0.776535
N  3.018532 0.286263 -0.054381
N  6.565922 3.057913 -1.846991
N  7.171786 1.432836 -0.281683
C  -4.191317 0.31429 -1.282675
C  -4.835436 1.721925 -1.039685
C  -6.250933 1.372876 -0.50174
C  -6.048429 -0.065306 -0.013419
C  -2.67775 0.280364 -0.98994
C  -1.009262 -1.148679 0.198042
C  -0.709378 -2.298796 0.96568
C  0.216435 -0.456106 -0.032637
C  1.244257 -1.198059 0.598656
C  1.339211 -3.378252 1.976171
C  2.678943 -0.909979 0.648777
C  4.320551 0.53784 -0.199143
C  4.790232 1.713326 -0.854611
C  6.145415 2.049515 -0.987323
H  -4.311873 0.017861 -2.345884
H  -4.855766 2.33365 -1.954511
H  -4.248977 2.270122 -0.282712
H  -7.01389 1.388658 -1.304807
H  -6.595185 2.050349 0.300544
H  -3.117964 -1.383963 0.06245
H  -1.368534 -3.079278 1.34265
H  0.359028 0.467937 -0.581993
H  -7.805461 -0.176638 1.117817
H  -6.854867 -1.650888 1.060138
H  2.108017 -3.871623 1.360762
H  1.848363 -2.950265 2.854161
H  0.587243 -4.117569 2.300762
H  5.060903 -0.19879 0.183645
H  4.038777 2.39139 -1.271175
H  5.897421 3.45353 -2.502922
H  7.420556 3.578426 -1.657721
H  8.10506 1.366638 -0.684041
H  6.935678 0.803435 0.481488
