program: Gaussian 09
title: 000005790
version: EM64L-G09RevD.01
frameworkgroup: C1[X(C9H11FN2O5)]
method: RPBEPBE
basis: SDD
operation: Freq
keyword: #p
keyword: freq=noraman
keyword: PBEPBE/SDD
title: #p freq=noraman PBEPBE/SDD
converged: YES YES NO NO
title: Mulliken charges:
elementType: F O O O O O N N C C C C C C C C C H H H H H H H H H H H
charge: -0.168415 -0.253256 -0.427296 -0.444089 -0.265273 -0.223286 -0.188672 -0.406030 -0.128638 0.002205 -0.546093 -0.044604 -0.378189 0.223528 -0.189929 0.160660 0.104909 0.216869 0.288061 0.238620 0.286098 0.290337 0.208446 0.220845 0.342403 0.355355 0.365695 0.359741
chargesum: 0.00000
title: Mulliken charges with hydrogens summed into heavy atoms:
elementType: F O O O O O N N C C C C C C C C C
charge: -0.168415 -0.253256 -0.084893 -0.084348 -0.265273 -0.223286 -0.188672 -0.040335 0.088231 0.290266 -0.021375 0.245733 0.051102 0.223528 0.165425 0.160660 0.104909
polarizability: 1.67284074e+02 1.11934207e+01 1.34397353e+02 6.37732858e+00 -5.39613435e-01 7.76426804e+01
1716.lowfreq: -12.7620 -10.3516 -0.0012 -0.0009 -0.0007 3.2603 36.0896 45.9183 73.3926
frequency: 35.9867 45.8724 73.3793 101.6913 119.3691 125.7206 161.3367 179.9630 200.9941 246.5889 284.2167 293.6841 298.9721 307.0374 325.7010 342.6935 378.8338 387.0666 420.9025 454.2653 462.3606 504.7226 546.8073 618.3512 663.7567 692.3608 712.1440 713.1852 737.6953 759.0394 770.1814 803.6876 833.4626 860.8440 932.6190 943.1203 952.3340 973.2922 986.4220 1036.9784 1045.5226 1053.0330 1071.4806 1087.2062 1124.4935 1160.5726 1175.3251 1198.1551 1199.9469 1226.7332 1249.3363 1252.4383 1267.3800 1289.4418 1309.6688 1323.0889 1335.8219 1361.2915 1364.9347 1380.9725 1408.2990 1411.4941 1457.8446 1468.4003 1617.7077 1637.6511 1661.2839 2935.1144 2973.7372 2994.6739 3036.1420 3067.2702 3098.1061 3108.0951 3122.8538 3523.5906 3567.5338 3578.7272
redmass: 5.6534 6.3014 7.9869 4.9687 7.4332 5.3323 4.9363 6.7960 3.6171 6.3004 6.6672 1.2666 1.5417 2.4439 5.8113 5.7104 12.0415 6.1100 4.2463 5.2576 3.8164 3.0393 5.3900 4.9278 4.9798 2.0310 7.6471 7.8945 6.7029 5.1272 2.1886 3.4953 3.4714 3.1892 2.7788 2.1721 1.6689 3.8152 2.0030 3.1478 2.9471 3.6184 2.5353 2.7885 7.2849 1.2147 1.3140 1.4366 3.1598 1.2662 1.3637 1.5650 1.5742 1.3975 1.4443 1.7002 1.2466 1.7068 1.7532 1.5201 2.4173 1.8960 1.0877 1.0783 5.8735 11.9663 6.3631 1.0571 1.0855 1.1032 1.0645 1.0885 1.0887 1.1015 1.0961 1.0771 1.0663 1.0667
irintensity: 3.1883 3.0958 1.2144 5.7415 3.0198 7.1985 6.2850 4.9546 11.4680 4.4284 2.4278 103.6042 120.1517 95.1194 26.1441 6.8113 9.4346 0.6303 6.5438 4.3392 2.6111 32.2802 21.3129 6.2311 16.3360 12.0514 12.4161 6.5893 8.0015 2.2402 116.7966 18.5722 13.6552 15.9204 45.6107 49.4199 23.5341 70.1791 23.0581 89.2222 49.8856 81.7875 34.3375 5.4425 54.6635 60.4942 11.4824 23.2208 37.6370 5.4871 24.9513 83.7221 235.7442 5.3477 16.6042 24.8439 1.3795 0.3025 16.9923 2.0293 36.3564 16.7626 12.9167 9.2357 295.0249 154.4864 584.8426 41.7480 48.5944 65.4401 13.4355 7.1858 11.8093 12.7570 94.2744 62.2433 9.1132 11.3002
temp: 298.150 k
press: 1.00000 atm
elementType: 9 8 8 8 8 8 7 7 6 6 6 6 6 6 6 6 6 1 1 1 1 1 1 1 1 1 1 1
symmnumber: 1
zpe: 540909.5 jmol-1
zpe.correction: 0.206022 hartree
zpe.thermalcorrener: 0.221771 hartree
zpe.thermalcorrenthalpy: 0.222716 hartree
zpe.thermalcorrgfe: 0.162565 hartree
zpe.sumelectzpe: -933.719466 hartree
zpe.sumelectthermal: -933.703717 hartree
zpe.sumelectthermalent: -933.702772 hartree
zpe.sumelectthermalfe: -933.762923 hartree
dipole: -5.9878 -0.2871 4.0263
dipole: 7.2213
quadrupole: -116.9365 -96.0249 -96.8755
quadrupole: -4.1790 -12.8415 4.8356
quadrupole: -13.6576 7.2541 6.4035 -4.1790 -12.8415 4.8356
hfenergy: -933.925488 hartree
pointgroup: C01 [X(C9H11F1N2O5)]
dipole: 2.3290386 0.1975805 1.6149984 debye
polarizability: 164.2831536|15.3001814|136.6368658|-4.7620451|6.6396597|78.4040881 unknown
InChI: InChI=1S/C9H11FN2O5/c10-4-2-12(9(16)11-8(4)15)7-1-5(14)6(3-13)17-7/h2,5-7,11,13-14H,1,3H2
charge 0 multiplicity 1
28 atoms
F  -2.392241 -2.623933 -0.462533
O  1.749581 -0.081432 -1.110035
O  4.081232 1.486169 -0.00024
O  1.871612 -2.766173 -0.315656
O  -1.050805 2.662613 0.33429
O  -4.350112 -0.681896 0.380305
N  -0.427997 0.474952 -0.243717
N  -2.667333 0.954034 0.334949
C  3.090791 0.679266 0.720637
C  0.9796 0.976214 -0.490073
C  1.706901 1.370892 0.826584
C  2.807652 -0.545053 -0.170302
C  2.358705 -1.769104 0.64325
C  -1.366575 1.451512 0.152927
C  -0.777944 -0.856639 -0.459137
C  -2.064389 -1.282026 -0.25363
C  -3.144008 -0.387145 0.170962
H  3.478038 0.39138 1.720541
H  0.894043 1.816938 -1.197054
H  1.148036 0.990968 1.699707
H  1.779224 2.464939 0.92741
H  3.671647 -0.797339 -0.804089
H  1.558441 -1.494997 1.365295
H  3.234276 -2.147155 1.212107
H  4.183263 2.362665 0.449524
H  0.022082 -1.525978 -0.799312
H  -3.368613 1.64513 0.621571
H  1.692691 -3.621501 0.149217
