program: Gaussian 09
title: 000037814
version: EM64L-G09RevD.01
frameworkgroup: C1[X(C22H26N2O)]
method: RPBEPBE
basis: SDD
operation: Freq
keyword: #p
keyword: freq=noraman
keyword: PBEPBE/SDD
title: #p freq=noraman PBEPBE/SDD
converged: YES YES NO NO
title: Mulliken charges:
elementType: O N N C C C C C C C C C C C C C C C C C C C C C C H H H H H H H H H H H H H H H H H H H H H H H H H H
charge: -0.270839 -0.249590 -0.076880 0.152004 0.142329 0.195818 0.168633 -0.473046 -0.472946 0.191441 -0.402109 -0.349888 -0.614250 -0.346667 0.122853 -0.341491 0.461744 -0.377940 -0.347864 -0.364875 -0.828906 -0.281256 -0.230384 -0.615108 -0.627957 0.230596 0.268430 0.236670 0.208185 0.221594 0.239297 0.222030 0.210504 0.238377 0.232030 0.213109 0.174610 0.224033 0.249564 0.252677 0.222224 0.225390 0.226359 0.230035 0.230065 0.225626 0.187300 0.223376 0.221480 0.184940 0.238673
chargesum: 0.00000
title: Mulliken charges with hydrogens summed into heavy atoms:
elementType: O N N C C C C C C C C C C C C C C C C C C C C C C
charge: -0.270839 -0.249590 -0.076880 0.152004 0.142329 0.195818 0.168633 0.025980 -0.028091 0.191441 0.058782 0.082646 -0.375873 -0.114637 0.122853 0.046228 0.461744 -0.153907 -0.098301 -0.112198 -0.154933 -0.051220 -0.000319 0.021194 0.017135
polarizability: 2.94855389e+02 2.57464454e+01 3.90235641e+02 4.31072703e+00 1.67184116e+00 1.44209641e+02
1716.lowfreq: -8.5853 -5.9146 0.0006 0.0007 0.0007 1.5727 10.1049 24.0530 29.9236
frequency: 7.6524 23.8129 29.9197 49.9289 69.8433 75.0208 92.1682 102.1208 117.5557 146.5888 150.9552 169.7160 189.5286 198.9020 214.7788 236.5018 247.8093 255.9933 276.0040 298.1212 315.2190 333.6307 339.4499 343.9142 358.2572 378.6760 390.3811 426.5104 440.3505 474.8556 481.2899 498.4909 516.3100 531.4419 560.6372 576.0618 595.3190 613.1214 650.6853 671.2472 682.9510 725.4838 746.2674 751.9010 757.4807 771.4228 775.2203 794.2421 812.7850 815.0571 855.2900 870.4129 879.4745 885.1932 891.7828 931.6432 950.9718 959.7217 979.0402 980.7989 1003.4132 1014.6984 1027.7292 1032.6597 1034.3326 1046.2317 1046.7490 1054.4023 1071.5419 1081.3841 1093.1610 1098.9991 1109.7035 1133.2780 1147.2540 1167.6810 1170.1972 1183.7039 1194.4773 1207.8748 1217.0281 1231.0839 1243.3083 1253.9461 1261.9021 1271.1473 1281.1211 1293.7978 1298.2806 1312.6255 1331.3342 1352.3720 1362.3538 1370.0656 1374.2710 1379.5176 1392.3986 1396.4016 1414.3361 1419.4334 1426.4066 1441.5054 1448.0410 1460.2355 1461.0113 1462.6747 1466.9848 1470.1096 1472.7006 1475.4976 1479.2859 1480.7575 1481.8900 1486.5224 1492.6481 1498.1875 1552.0662 1569.6730 1584.1596 1605.7209 1628.2154 2810.4792 2842.0779 2858.8467 2953.0116 2970.2421 2974.3964 2989.3653 2995.9785 3006.5356 3007.3037 3018.7663 3031.4085 3046.3578 3056.2513 3077.0784 3078.1296 3079.0933 3079.9181 3089.1128 3118.1355 3123.2318 3132.6197 3147.7398 3149.4666 3167.1717 3178.3015
redmass: 2.7107 3.7912 4.3247 4.1994 1.1053 3.4062 3.4436 3.0040 3.3878 3.6670 3.2578 2.2090 3.9887 3.3420 3.1689 1.1852 1.1304 4.2860 3.8535 2.8207 2.8825 2.6082 2.9634 3.1175 3.5131 4.4512 3.8888 2.3865 3.1663 3.5358 3.7707 4.0353 4.4537 4.9303 3.9176 3.1281 3.4931 5.5581 4.8877 5.9887 5.0113 2.9368 4.5940 1.3594 3.0816 2.5284 1.7162 1.4364 3.3525 4.1411 1.8224 1.7396 1.6299 1.5642 3.1271 1.3310 1.3656 2.4247 1.3103 3.3738 1.9801 2.5583 2.8361 2.1866 1.7615 1.5958 2.7784 2.2159 2.1443 2.1205 1.3867 1.7389 1.8380 1.6108 1.5803 1.1591 1.5572 2.0994 2.2718 2.1789 1.2686 1.5303 2.0224 1.5333 2.1809 1.6265 1.6667 1.1411 1.4896 1.5027 4.1555 1.6250 2.6741 1.2840 2.0144 1.4955 2.6263 1.2803 4.8818 1.1451 2.3703 1.1653 1.1391 2.2257 1.0761 1.0635 1.5672 1.0467 1.3860 1.0673 1.0658 2.1087 1.2315 1.0858 1.4775 1.3568 6.9368 6.7298 7.0188 6.6864 7.0880 1.0705 1.0574 1.0573 1.0612 1.0372 1.0681 1.0762 1.0846 1.0826 1.0611 1.0722 1.0717 1.0977 1.0965 1.1008 1.0983 1.0994 1.1045 1.1002 1.0877 1.0913 1.0855 1.0959 1.0909 1.0954 1.0965
irintensity: 0.4223 0.0942 0.3759 0.7411 0.1450 2.0217 0.7905 0.3815 0.2769 1.4803 3.6186 0.5600 0.7859 0.8249 0.8840 1.3674 0.4032 2.1003 1.8152 5.0600 2.0795 8.3751 3.2696 0.5784 1.5024 3.7171 2.9672 0.3980 3.4708 4.9167 7.2900 8.3672 2.9684 4.6289 6.9544 1.4770 5.9190 4.7563 1.2546 7.3761 2.3971 1.1048 3.3055 26.0889 14.5262 10.4462 43.8953 42.3058 3.4497 24.1097 6.1891 1.8530 13.8168 2.4628 13.6194 0.1554 4.2711 2.5478 0.6668 8.5380 9.3912 22.0260 24.8028 12.0861 20.8278 10.6556 0.5365 19.8975 16.3359 3.6698 5.6077 24.4969 8.9435 2.0719 5.1115 4.3759 23.6895 11.9491 56.0051 11.8492 2.7170 1.8168 1.4280 14.9033 7.1433 1.5429 2.7094 4.8712 3.2247 18.3405 38.4594 14.7665 34.5418 8.4800 11.6191 13.9150 8.9429 11.0020 32.9718 2.9370 12.3191 3.6500 5.9758 32.7908 9.5073 15.9457 44.9815 11.8441 12.9636 6.2639 17.2176 12.0028 19.6456 20.6825 14.3518 29.4308 16.6594 11.1458 1.6893 5.0675 9.5499 76.5269 66.5718 216.3590 37.6645 67.2619 27.4763 22.1505 17.7255 47.0668 34.9176 40.5761 43.9331 24.6330 11.5416 14.0523 15.6526 51.8752 35.2943 46.2617 9.6078 22.6985 1.7325 24.9827 16.8496 20.6820 10.9458
temp: 298.150 k
press: 1.00000 atm
elementType: 8 7 7 6 6 6 6 6 6 6 6 6 6 6 6 6 6 6 6 6 6 6 6 6 6 1 1 1 1 1 1 1 1 1 1 1 1 1 1 1 1 1 1 1 1 1 1 1 1 1 1
symmnumber: 1
zpe: 1124893.0 jmol-1
zpe.correction: 0.428449 hartree
zpe.thermalcorrener: 0.451884 hartree
zpe.thermalcorrenthalpy: 0.452828 hartree
zpe.thermalcorrgfe: 0.373532 hartree
zpe.sumelectzpe: -1036.826931 hartree
zpe.sumelectthermal: -1036.803497 hartree
zpe.sumelectthermalent: -1036.802552 hartree
zpe.sumelectthermalfe: -1036.881849 hartree
dipole: -1.8000 0.7689 0.4062
dipole: 1.9991
quadrupole: -131.1911 -140.9620 -154.6003
quadrupole: 0.3343 8.8324 -1.7505
quadrupole: 11.0601 1.2891 -12.3492 0.3343 8.8324 -1.7505
hfenergy: -1037.2553805 hartree
pointgroup: C01 [X(C22H26N2O1)]
dipole: 0.4929751 -0.5922246 0.1575388 debye
polarizability: 335.5444495|53.7513941|349.5066528|-5.3329209|0.3668227|144.2495677 unknown
InChI: InChI=1S/C22H26N2O/c1-16-9-10-20-19(15-16)17-11-14-25-21-8-5-4-7-18(21)22(17)24(20)13-6-12-23(2)3/h4-5,7-10,15H,6,11-14H2,1-3H3
charge 0 multiplicity 1
51 atoms
O  -1.611887 3.646901 -0.4504
N  -0.044374 -0.422413 -0.197354
N  4.525775 -2.509658 0.363293
C  -0.591573 0.882285 0.050065
C  -1.985263 0.746342 0.231368
C  -1.089469 -1.355989 -0.157713
C  -2.308167 -0.656281 0.118423
C  1.26191 -0.777198 -0.78963
C  -3.036396 1.80529 0.444133
C  0.258819 2.087872 0.095782
C  2.205935 -1.532489 0.175973
C  -2.49419 3.21573 0.66751
C  -3.528963 -1.37833 0.20544
C  -1.07786 -2.751514 -0.384832
C  -0.240743 3.390954 -0.233176
C  3.479431 -2.003977 -0.555951
C  -3.535236 -2.773501 0.001133
C  -2.303145 -3.440105 -0.299097
C  1.642822 2.018829 0.447028
C  0.617967 4.504982 -0.348817
C  -4.82343 -3.576139 0.089664
C  2.499508 3.13355 0.36103
C  1.99609 4.380352 -0.077354
C  5.81886 -2.691377 -0.329207
C  4.123132 -3.729794 1.092633
H  1.065582 -1.4139 -1.676472
H  1.745817 0.14125 -1.159902
H  -3.708104 1.821626 -0.438018
H  -3.677516 1.542624 1.313168
H  2.50658 -0.883972 1.019734
H  1.662374 -2.389634 0.613045
H  -3.316312 3.951456 0.679663
H  -1.92897 3.284865 1.617355
H  -4.468576 -0.855209 0.421034
H  -0.155198 -3.294141 -0.6154
H  3.91301 -1.144898 -1.106325
H  3.199188 -2.772562 -1.327609
H  -2.318412 -4.524607 -0.465318
H  2.046048 1.078218 0.829428
H  0.171963 5.46389 -0.631019
H  -5.692087 -2.923736 0.285731
H  -5.022778 -4.126909 -0.849283
H  -4.778713 -4.32619 0.902579
H  3.552627 3.02912 0.643118
H  2.65557 5.250131 -0.166905
H  6.129047 -1.739171 -0.795638
H  5.789977 -3.475604 -1.1290
H  6.593937 -2.981532 0.402607
H  4.942399 -4.039781 1.765308
H  3.888822 -4.590556 0.413517
H  3.235472 -3.531802 1.716359
