program: Gaussian 09
title: 000037806
version: EM64L-G09RevD.01
frameworkgroup: C1[X(C12H7Cl3)]
method: RPBEPBE
basis: SDD
operation: Freq
keyword: #pfreq=noraman
keyword: PBEPBE/SDD
title: #p freq=noraman PBEPBE/SDD
converged: NO YES NO NO
title: Mulliken charges:
elementType: Cl Cl Cl C C C C C C C C C C C C H H H H H H H
charge: -0.011026 -0.057363 -0.002427 0.388087 0.360688 -0.353415 -0.397888 -0.343504 -0.398423 -0.087515 -0.210167 -0.108873 -0.213047 -0.111985 -0.240280 0.270463 0.249197 0.266777 0.243995 0.259751 0.235558 0.261398
chargesum: 0.00000
title: Mulliken charges with hydrogens summed into heavy atoms:
elementType: Cl Cl Cl C C C C C C C C C C C C
charge: -0.011026 -0.057363 -0.002427 0.388087 0.360688 -0.082952 -0.148691 -0.076727 -0.154427 -0.087515 0.049584 -0.108873 0.022511 -0.111985 0.021118
polarizability: 2.62462860e+02 -2.68708356e+00 1.64014869e+02 5.94706842e+00 -2.12990171e+00 6.69461656e+01
1716.lowfreq: -4.1590 -0.0029 -0.0027 -0.0027 4.3735 6.3380 34.1798 55.2997 74.7841
frequency: 34.1260 55.2988 74.7830 129.8685 180.6317 185.1476 192.6804 215.8176 249.8830 293.2416 338.8122 379.8418 416.4466 427.3925 443.3357 460.2389 495.1331 543.9041 603.3021 638.3079 666.3145 691.0862 703.4009 707.6165 788.9618 814.9884 824.2022 879.1808 893.2457 906.5380 953.4759 977.2932 983.3322 999.3961 1038.5603 1079.3324 1096.8630 1124.1317 1152.3668 1183.8056 1252.6712 1277.9919 1297.7845 1340.6748 1367.3524 1392.7106 1417.5294 1449.6793 1484.8345 1553.4881 1573.9081 1596.2417 1606.1962 3138.1404 3150.2202 3157.3134 3159.4686 3162.9308 3173.4464 3177.9204
redmass: 11.5171 8.1407 8.4722 6.1507 24.1824 5.3986 7.2497 7.8141 8.6277 6.5790 6.4342 9.9526 8.7870 3.5278 3.1217 4.6104 8.0971 5.3300 5.1105 7.2301 7.0587 2.5234 3.8326 4.6673 1.4249 6.2299 1.4108 1.4106 1.4905 1.4462 1.3619 1.4383 4.6612 5.9761 4.0040 1.9167 1.6250 2.3298 1.4214 1.1014 1.4045 1.7145 1.6548 3.3952 10.0545 4.8485 2.9107 2.3140 3.0978 6.7381 7.1672 6.6038 6.6728 1.0870 1.0887 1.0931 1.0928 1.0918 1.0967 1.0979
irintensity: 0.1326 0.1612 0.1611 0.4919 0.0059 0.0862 0.1242 0.2502 1.1794 0.6744 0.6863 8.6782 1.0113 9.6249 1.9757 5.3283 19.3885 1.8224 4.3324 7.1505 10.8005 18.2387 16.3599 14.1606 72.9311 71.0290 22.5770 25.2536 1.4123 0.7763 1.0218 0.6201 2.0499 31.1498 16.5630 18.6205 9.4322 52.7456 1.3813 0.5385 1.1938 12.5794 0.1158 21.0669 1.1011 10.2548 11.4708 136.5426 10.2238 45.4328 29.4748 3.2679 34.1128 8.7840 2.5101 9.6714 3.5034 0.1010 3.1110 6.0240
temp: 298.150 k
press: 1.00000 atm
elementType: 17 17 17 6 6 6 6 6 6 6 6 6 6 6 6 1 1 1 1 1 1 1
symmnumber: 1
zpe: 392092.7 jmol-1
zpe.correction: 0.149340 hartree
zpe.thermalcorrener: 0.162312 hartree
zpe.thermalcorrenthalpy: 0.163256 hartree
zpe.thermalcorrgfe: 0.107917 hartree
zpe.sumelectzpe: -1840.626621 hartree
zpe.sumelectthermal: -1840.613649 hartree
zpe.sumelectthermalent: -1840.612705 hartree
zpe.sumelectthermalfe: -1840.668044 hartree
dipole: 1.5669 -3.2418 0.2641
dipole: 3.6102
quadrupole: -114.6860 -98.6736 -110.5867
quadrupole: -3.6619 3.8203 -0.3853
quadrupole: -6.7039 9.3085 -2.6046 -3.6619 3.8203 -0.3853
hfenergy: -1840.7759611 hartree
pointgroup: C01 [X(C12H7Cl3)]
dipole: -0.6585501 -1.2565652 -0.0695288 debye
dipolederiv: -0.2555458 -0.2361461 0.0629403 -0.3600016 -0.5343587 0.1386559 0.0961063 0.1386179 -0.0722985 -0.4114522 0.2792814 0.0788106 0.4266597 -0.5521527 -0.1432623 0.1214629 -0.1417943 -0.1121244 -0.8996971 0.0286812 -0.0455188 0.0279879 -0.0580033 0.0106532 -0.0574947 0.0086604 -0.0335737 0.350118 -0.0122347 0.0125159 0.0529702 0.0193906 -0.0347596 0.0084008 -0.0066905 0.0085311 0.4007173 0.0264185 0.0127643 -0.0499675 0.0669844 0.0482329 -0.0011913 0.0174129 0.0164837 -0.236653 -0.1391186 0.0461279 -0.0983136 -0.1786009 0.0038039 0.072392 0.0151674 -0.0934071 -0.140398 0.0308285 -0.0139443 0.0047615 0.0024153 -0.0616567 -0.052666 -0.0571067 -0.1323938 -0.3637389 0.1507504 0.0499944 0.1796176 -0.1915528 -0.0029707 0.0994918 -0.0140175 -0.1061645 -0.2485592 -0.064639 -0.0295728 -0.0625048 -0.040482 0.0512694 -0.0762258 0.0480066 -0.1399089 0.1088287 0.4677367 -0.1346094 0.5477565 0.8023677 -0.2311708 -0.1871246 -0.2292897 0.0296759 -0.2255578 0.0180545 -0.0090338 -0.1049268 0.023625 -0.0360792 0.0525271 -0.0340944 -0.0697297 0.567612 -0.4625374 -0.124516 -0.696505 0.823162 0.2590419 -0.2246696 0.2565273 0.025963 0.1192877 0.0041944 0.0097405 0.0769255 0.1026529 0.0766651 0.0670966 0.0766342 -0.1041931 1.1391009 -0.1702796 0.1065482 -0.0784908 -0.1300966 0.0247774 0.0923783 0.0143818 -0.0623303 -0.1715297 0.0832761 0.0281353 0.1480083 -0.2807072 -0.0541485 0.0475935 -0.0458447 -0.1360834 0.0707695 0.061418 -0.0252268 0.0675164 0.0327819 0.0415306 -0.0324021 0.0327144 0.1353208 0.0485126 -0.0897518 0.0224098 -0.0831028 -0.0026177 0.0504154 0.032833 0.038662 0.1337969 0.0903217 -0.062237 -0.0250083 -0.0745394 0.0224273 -0.047502 -0.0379469 -0.0388478 0.1349074 0.0516194 0.1011368 0.0303586 0.0927659 -0.0021889 -0.0542879 0.0411342 -0.0429085 0.1320371 0.0347384 0.0485013 -0.0209522 0.0526479 0.0120117 0.0476476 -0.0213149 0.0489816 0.1465461 0.0171091 -0.0611971 -0.0235367 -0.0819535 -0.047309 -0.0673754 -0.0299217 -0.0686095 0.1343544 -0.0456038 -0.0021364 -0.0084268 0.0126884 0.1102511 -0.0194801 -0.0104588 -0.016563 0.164591 unknown
polarizability: 262.7151133|-0.3335042|163.9783709|0.8885813|0.6252827|66.73041 unknown
InChI: InChI=1S/C12H7Cl3/c13-10-3-1-2-8(6-10)9-4-5-11(14)12(15)7-9/h1-7H
charge 0 multiplicity 1
22 atoms
Cl 3.373608 2.418322 -0.632448
Cl -4.209166 2.218522 0.622203
Cl 5.05444 -0.277699 0.236808
C  0.400833 -0.346733 0.01744
C  -1.088448 -0.378381 -0.053187
C  1.117353 0.841991 -0.283447
C  1.144405 -1.502412 0.384069
C  -1.851931 0.778296 0.265816
C  -1.777034 -1.562353 -0.437396
C  2.52261 0.87215 -0.220193
C  2.550617 -1.472041 0.447072
C  -3.254303 0.725487 0.195167
C  -3.185696 -1.589837 -0.499374
C  3.246819 -0.283319 0.144497
C  -3.946827 -0.441474 -0.18231
H  0.588207 1.744392 -0.604067
H  0.622337 -2.425308 0.655189
H  -1.359749 1.696725 0.599932
H  -1.207617 -2.453469 -0.721278
H  3.11583 -2.361348 0.741082
H  -3.701343 -2.505877 -0.806469
H  -5.039344 -0.452532 -0.228108
