program: Gaussian 09
title: 000037804
version: EM64L-G09RevD.01
frameworkgroup: C1[X(C12H7Cl3)]
method: RPBEPBE
basis: SDD
operation: Freq
keyword: #pfreq=noraman
keyword: PBEPBE/SDD
title: #p freq=noraman PBEPBE/SDD
converged: YES YES NO NO
title: Mulliken charges:
elementType: Cl Cl Cl C C C C C C C C C C C C H H H H H H H
charge: -0.027524 -0.041430 -0.042346 0.409448 0.397181 -0.282541 -0.345085 -0.297078 -0.357179 -0.201978 -0.225350 -0.218109 -0.230261 -0.097122 -0.223044 0.256494 0.250492 0.283021 0.261220 0.258404 0.235372 0.237414
chargesum: 0.00000
title: Mulliken charges with hydrogens summed into heavy atoms:
elementType: Cl Cl Cl C C C C C C C C C C C C
charge: -0.027524 -0.041430 -0.042346 0.409448 0.397181 -0.282541 -0.088590 -0.297078 -0.106687 0.081044 0.035871 0.040294 0.005110 -0.097122 0.014371
polarizability: 2.23527018e+02 -4.04624993e+00 1.34036074e+02 -1.31299602e+01 2.36511994e+00 1.02381263e+02
1716.lowfreq: -6.5141 -3.5497 -0.0027 -0.0002 0.0018 4.3917 29.2259 47.2502 67.2698
frequency: 29.1467 47.2411 67.2679 129.7812 143.2717 165.6956 172.5349 223.0971 256.2328 292.9747 364.0358 377.8181 394.7827 416.2878 459.9540 473.9037 485.6205 558.5801 566.7407 635.5078 661.7956 700.6186 718.5115 735.1260 762.7193 780.4003 822.7987 868.3634 868.9871 948.7653 954.8044 982.2289 987.3654 1023.3866 1037.7442 1074.7992 1082.5490 1123.9399 1139.0415 1173.1852 1236.9093 1255.8684 1289.8764 1341.8219 1361.4743 1374.9052 1418.8438 1444.5079 1482.2510 1560.6055 1570.1313 1591.1521 1608.4731 3135.8704 3147.1781 3150.8633 3162.6845 3176.1832 3179.6447 3184.8588
redmass: 10.5529 8.6965 6.6200 9.2459 6.2233 6.7089 13.6502 8.9054 6.4579 8.3092 7.5317 7.7667 6.1686 4.4508 3.7548 4.9793 8.1005 3.9765 3.7565 7.0256 6.9840 7.6355 4.3218 3.7348 1.2771 7.4889 1.3856 1.3934 1.3849 1.3718 1.3602 7.3426 1.3350 5.4301 2.7809 2.4991 2.2765 1.6768 1.3870 1.0569 1.5157 1.3871 2.1355 4.1890 8.7888 4.7289 2.1962 2.3268 3.3472 8.1063 6.3061 7.3683 7.5078 1.0860 1.0907 1.0897 1.0954 1.1000 1.0961 1.0938
irintensity: 0.1987 0.1280 0.4383 0.6986 0.3233 0.0028 0.5850 0.2166 1.0962 1.1265 4.5018 3.2992 1.8660 2.7292 7.2376 7.9666 14.7253 7.9358 10.8721 1.3705 7.9941 32.4730 1.1627 5.0373 78.0683 55.9560 30.8521 16.4757 3.8379 0.6026 0.4209 26.4285 0.0843 40.4667 16.5360 12.7351 33.7689 4.6664 1.6186 0.3681 2.3109 0.9334 1.9411 12.8388 1.4257 8.8197 23.6443 110.3505 25.9820 26.4431 9.5004 41.2483 2.3444 0.7631 11.2538 2.5949 13.0527 14.0125 1.2983 1.2721
temp: 298.150 k
press: 1.00000 atm
elementType: 17 17 17 6 6 6 6 6 6 6 6 6 6 6 6 1 1 1 1 1 1 1
symmnumber: 1
zpe: 391069.5 jmol-1
zpe.correction: 0.148950 hartree
zpe.thermalcorrener: 0.162077 hartree
zpe.thermalcorrenthalpy: 0.163021 hartree
zpe.thermalcorrgfe: 0.107208 hartree
zpe.sumelectzpe: -1840.623061 hartree
zpe.sumelectthermal: -1840.609934 hartree
zpe.sumelectthermalent: -1840.608990 hartree
zpe.sumelectthermalfe: -1840.664803 hartree
dipole: 2.0614 -2.6609 -0.2881
dipole: 3.3783
quadrupole: -99.6570 -102.2877 -108.5826
quadrupole: -3.4681 -1.2831 -0.0621
quadrupole: 3.8521 1.2214 -5.0735 -3.4681 -1.2831 -0.0621
hfenergy: -1840.772011 hartree
pointgroup: C01 [X(C12H7Cl3)]
dipole: -0.867125 0.0236169 -1.0070249 debye
dipolederiv: -0.2605709 -0.1565514 0.1565893 -0.1829521 -0.321931 0.2905507 0.1870749 0.2899348 -0.3437456 -0.2316448 -0.1220983 -0.1768781 -0.1116567 -0.2427134 -0.2808368 -0.1663181 -0.2800978 -0.4630151 -0.9296472 -0.0490777 0.036079 -0.0313187 -0.0915057 0.0338193 0.0025163 0.0352771 -0.0992205 0.2424965 -0.0908891 0.0322325 -0.0859253 -0.128474 0.1281364 0.0444704 0.1140962 -0.1529689 0.2745099 -0.0811545 -0.0310422 -0.0675888 -0.0754058 -0.0995095 -0.0292498 -0.0853737 -0.1578433 0.3215624 0.2811855 -0.2658534 0.2127075 0.4285099 -0.4737595 -0.1917147 -0.5029132 0.4795774 0.0148779 0.0315719 -0.0256005 0.0472627 -0.0080997 -0.1068683 -0.0847202 -0.0953888 -0.0048751 0.183049 0.2308108 0.3146856 0.1548521 0.2655754 0.4387554 0.1926577 0.4717197 0.6342622 -0.0901947 0.0040999 -0.0030085 -0.0080534 -0.0555542 0.0908478 0.0336243 0.079274 0.003201 -0.4717835 -0.136161 0.1325075 -0.0959197 -0.1522757 0.0836174 0.0873611 0.0910071 -0.1479108 -0.4205095 0.0341688 -0.0386128 0.0562044 -0.0801958 -0.0424188 -0.0344175 -0.0333238 -0.0677518 -0.1432941 -0.0984364 -0.1452296 -0.0617254 -0.1308882 -0.0332749 -0.0888259 -0.0434493 -0.145578 -0.0916039 0.0453524 0.0634923 0.0577047 -0.0964913 0.0950587 0.0372236 0.0866575 -0.0034658 1.3614326 0.0640491 -0.0267532 0.0550642 0.0673766 -0.1394003 -0.0005344 -0.1448983 0.0989751 0.1013338 -0.0051827 -0.0200777 0.0140509 -0.0908393 0.0849217 0.0099299 0.0896404 -0.011543 0.0395906 0.0418101 -0.0605074 0.0491188 0.0697766 0.0685201 -0.0627192 0.07842 0.0507099 0.0462074 0.0409087 0.0760833 0.048682 0.0875063 -0.0667802 0.0795562 -0.0769021 0.0248032 0.0648608 0.0235859 -0.0259498 0.0188199 0.1136211 0.0598734 -0.0317194 0.0603228 0.096229 0.0430068 -0.0411086 0.045261 -0.0423345 0.0953535 0.0818272 0.0419828 0.0800522 0.0736482 0.0415171 0.0304387 0.0429615 0.0346632 0.1127073 -0.0735689 0.0640565 -0.0738963 0.0435313 0.023528 -0.0371401 -0.0633024 -0.0509912 0.0966526 -0.1034986 -0.0789775 -0.101415 -0.0062949 -0.1187241 -0.0101819 -0.017076 -0.0106646 0.1372949 -0.0360123 -0.0112568 -0.0387433 0.0992757 unknown
polarizability: 224.1134004|11.1971675|102.0375024|0.6797319|-2.2147597|133.7934515 unknown
InChI: InChI=1S/C12H7Cl3/c13-8-5-6-10(12(15)7-8)9-3-1-2-4-11(9)14/h1-7H
charge 0 multiplicity 1
22 atoms
Cl 0.366646 -1.848337 1.888145
Cl -1.156794 1.50857 2.121103
Cl 5.050247 0.197398 -0.231301
C  0.398158 0.028273 -0.203987
C  -1.096957 -0.014687 -0.241965
C  1.177822 -0.735069 0.700344
C  1.10056 0.837884 -1.135863
C  -1.918622 0.597013 0.736442
C  -1.751097 -0.668408 -1.320956
C  2.586485 -0.696571 0.710579
C  2.51038 0.901663 -1.159245
C  -3.324967 0.555705 0.674911
C  -3.159054 -0.7215 -1.405165
C  3.23095 0.131793 -0.227162
C  -3.947816 -0.112272 -0.403321
H  0.523217 1.439803 -1.845229
H  -1.135432 -1.150968 -2.08793
H  3.157405 -1.298126 1.421649
H  3.031357 1.537382 -1.879836
H  -3.919505 1.042876 1.453044
H  -3.635956 -1.238992 -2.243894
H  -5.040926 -0.15003 -0.456163
