program: Gaussian 09
title: 000037786
version: EM64L-G09RevD.01
frameworkgroup: C1[X(C20H12O)]
method: RPBEPBE
basis: SDD
operation: Freq
keyword: #pfreq=noraman
keyword: PBEPBE/SDD
title: #p freq=noraman PBEPBE/SDD
converged: NO NO NO NO
title: Mulliken charges:
elementType: O C C C C C C C C C C C C C C C C C C C C H H H H H H H H H H H H
charge: -0.211684 -0.348708 -0.337501 0.416725 0.377380 -0.014303 -0.023209 0.301137 -0.774833 0.487390 -0.452841 0.167821 0.461847 -0.437428 -0.511900 -0.453376 -0.238424 -0.350854 -0.458893 -0.259388 -0.248260 0.256061 0.256957 0.262169 0.258788 0.227206 0.239912 0.244472 0.230047 0.222976 0.248522 0.229825 0.232364
chargesum: 0.00000
title: Mulliken charges with hydrogens summed into heavy atoms:
elementType: O C C C C C C C C C C C C C C C C C C C C
charge: -0.211684 -0.092646 -0.080543 0.416725 0.377380 -0.014303 -0.023209 0.301137 -0.512664 0.487390 -0.194053 0.167821 0.461847 -0.210221 -0.271988 -0.208903 -0.008377 -0.127879 -0.210372 -0.029562 -0.015896
polarizability: 3.85267464e+02 -8.32196358e+00 2.33509212e+02 -5.10530658e-01 1.69303680e-01 9.03619044e+01
1716.lowfreq: -2.5451 -0.0006 -0.0004 0.0004 8.4202 10.6234 59.5233 81.4061 134.4828
frequency: 59.5062 81.4058 134.4820 164.4972 185.2142 201.9566 257.0083 268.0696 288.3473 330.0421 341.6104 373.3500 397.8010 433.5816 460.9512 467.6562 505.9409 516.7814 533.7876 554.0716 566.5780 569.6634 584.8731 614.6813 640.8972 673.5284 703.1894 722.6629 750.5883 762.5655 774.2024 781.9793 801.0635 810.2372 842.8129 854.3854 860.7475 873.6434 881.9684 916.9215 922.1078 961.1118 971.8759 975.2434 988.3459 992.6488 1010.8064 1027.5074 1040.4686 1068.9697 1083.6781 1098.9200 1106.1948 1152.8663 1177.4142 1181.0360 1190.3919 1217.1158 1232.5660 1248.3692 1259.5425 1275.0074 1287.4465 1325.6975 1331.2690 1361.0053 1370.9908 1387.8785 1401.1136 1406.2060 1421.1651 1441.5494 1458.1442 1476.9570 1500.6532 1533.5831 1578.9041 1601.9752 1619.4738 1626.1458 1646.3978 3054.3846 3063.0097 3125.4457 3126.7496 3129.6710 3137.0199 3141.2660 3146.3467 3152.7322 3164.6049 3165.5930 3171.3697
redmass: 5.1532 4.3409 4.9882 4.5955 5.0840 4.8210 4.8108 6.9463 4.6020 6.7815 5.0002 3.7800 3.8767 5.7903 4.1397 4.3756 4.7239 3.3920 5.8864 4.8042 3.6165 5.5739 4.1268 4.6081 6.2698 5.8396 4.2468 4.4884 3.4583 1.4892 2.2135 1.6119 3.5271 6.1000 5.2372 1.9125 3.0049 1.6572 5.3183 1.4245 1.9156 1.4912 4.4778 1.3841 1.4067 1.3485 3.7536 1.7893 2.2269 2.2161 3.0693 1.6064 2.0404 1.5864 1.1305 1.2013 1.6174 1.9134 1.9003 2.2269 2.1756 1.8225 1.9293 2.4766 1.1786 2.1373 2.2165 2.4890 4.6373 5.8250 3.1314 3.5730 3.1920 3.0729 4.0561 4.7109 8.3264 6.0309 6.1574 7.0562 7.8692 1.0861 1.0840 1.0866 1.0875 1.0878 1.0888 1.0922 1.0919 1.0948 1.0972 1.0987 1.0962
irintensity: 0.8081 0.4518 0.0976 0.8321 0.4165 1.9325 6.3776 3.5042 3.0697 0.6464 0.5404 10.2177 2.3086 0.6065 2.2915 1.2333 2.9260 0.6607 1.9884 4.0604 0.5068 0.6765 1.4119 6.5595 2.6946 2.4157 1.5227 2.9681 5.1028 39.4618 92.6131 4.9345 32.8009 24.8006 1.7874 17.3612 41.3761 1.7748 6.3998 0.9881 18.4582 6.0433 3.1207 0.7249 1.0332 0.6604 5.1504 20.4441 6.6543 12.2893 8.1747 0.6917 0.7347 1.5456 0.5839 3.5188 6.9915 2.4828 0.5197 7.1381 14.7904 1.3847 4.1240 0.5110 5.4834 5.5505 2.2838 44.2611 3.2247 0.1644 2.3439 3.1690 4.7168 14.8538 1.4657 2.2538 0.1752 3.2648 0.7548 3.7390 5.2976 1.5693 15.2394 3.0552 1.0007 6.2872 6.8326 6.9952 17.2228 15.6063 12.3514 41.2801 40.3886
temp: 298.150 k
press: 1.00000 atm
elementType: 8 6 6 6 6 6 6 6 6 6 6 6 6 6 6 6 6 6 6 6 6 1 1 1 1 1 1 1 1 1 1 1 1
symmnumber: 1
zpe: 664407.1 jmol-1
zpe.correction: 0.253059 hartree
zpe.thermalcorrener: 0.267028 hartree
zpe.thermalcorrenthalpy: 0.267972 hartree
zpe.thermalcorrgfe: 0.212954 hartree
zpe.sumelectzpe: -843.108955 hartree
zpe.sumelectthermal: -843.094986 hartree
zpe.sumelectthermalent: -843.094042 hartree
zpe.sumelectthermalfe: -843.149060 hartree
dipole: -1.0492 -3.2036 0.0125
dipole: 3.3711
quadrupole: -101.3515 -118.0112 -125.3163
quadrupole: -7.9709 0.3004 -0.2503
quadrupole: 13.5415 -3.1182 -10.4233 -7.9709 0.3004 -0.2503
hfenergy: -843.3620145 hartree
pointgroup: C01 [X(C20H12O1)]
dipole: -0.4024815 -1.2637129 0.0084117 debye
polarizability: 385.3918271|-7.083034|233.3833802|-0.8161852|-0.1741257|90.3633733 unknown
InChI: InChI=1S/C20H12O/c1-2-6-13-12(4-1)10-16-18-14(13)9-8-11-5-3-7-15(17(11)18)19-20(16)21-19/h1-10,19-20H
charge 0 multiplicity 1
33 atoms
O  1.866809 3.436717 0.016292
C  1.020434 2.286241 -0.515956
C  2.036637 2.007457 0.525103
C  -0.218339 1.507735 -0.197034
C  2.726393 0.722467 0.176126
C  0.223684 0.101694 -0.056465
C  1.657221 -0.262019 -0.009149
C  -0.770462 -0.925642 -0.031194
C  -1.554252 1.845171 -0.19169
C  2.031504 -1.647954 -0.077316
C  4.067092 0.342231 0.187023
C  -2.189048 -0.561368 0.01246
C  -2.568985 0.831518 -0.041693
C  -0.341671 -2.304096 -0.061387
C  0.998735 -2.650364 -0.118145
C  3.419316 -2.00582 -0.086928
C  4.417445 -1.032813 0.017603
C  -3.233537 -1.533666 0.118596
C  -3.950372 1.1941 0.014278
C  -4.581293 -1.156662 0.173244
C  -4.947131 0.219461 0.120653
H  1.359509 2.094183 -1.546035
H  1.648721 1.991719 1.555531
H  -1.858072 2.890592 -0.311441
H  4.845222 1.097254 0.336272
H  -1.090158 -3.100756 -0.064872
H  1.295141 -3.704145 -0.174961
H  3.688588 -3.065386 -0.167499
H  5.473007 -1.324093 0.002541
H  -2.988408 -2.598355 0.170122
H  -4.216732 2.256649 -0.028941
H  -5.359077 -1.922902 0.259702
H  -6.002922 0.506651 0.163861
