program: Gaussian 09
title: 000037757
version: EM64L-G09RevD.01
frameworkgroup: C1[X(C11H14ClNO)]
method: RPBEPBE
basis: SDD
operation: Freq
keyword: #p
keyword: freq=noraman
keyword: PBEPBE/SDD
title: #p freq=noraman PBEPBE/SDD
converged: YES YES NO NO
title: Mulliken charges:
elementType: Cl O N C C C C C C C C C C C H H H H H H H H H H H H H H
charge: -0.065496 -0.264090 -0.331692 -0.204076 -0.492013 -0.352770 0.412350 -0.311144 0.187567 -0.412975 -0.334057 -0.632051 -0.258302 -0.091050 0.197157 0.210279 0.218832 0.193080 0.234829 0.191725 0.220249 0.260139 0.236825 0.278210 0.184655 0.220086 0.249209 0.254524
chargesum: 0.00000
title: Mulliken charges with hydrogens summed into heavy atoms:
elementType: Cl O N C C C C C C C C C C C
charge: -0.065496 -0.264090 -0.071553 -0.006920 -0.062903 0.075140 0.412350 0.100831 0.187567 -0.176150 -0.055847 0.021898 -0.003778 -0.091050
polarizability: 1.85776247e+02 5.54565836e+00 1.27408262e+02 -1.85595439e+00 1.33998798e+01 9.52094299e+01
1716.lowfreq: -17.5708 -4.8329 -0.0030 -0.0029 -0.0028 7.5353 54.6028 62.0354 102.9079
frequency: 54.5782 62.0300 102.8565 138.7513 167.8070 181.8643 190.3419 223.1606 248.8156 297.2479 313.8345 330.3186 388.4254 400.6593 422.7676 467.3078 491.3305 549.1929 562.3129 589.2730 604.2485 675.4278 739.7845 747.2668 790.7683 814.4869 838.1915 865.2735 880.6482 930.7826 941.5378 947.3098 968.6310 1024.6353 1068.7349 1078.8455 1096.9541 1106.1486 1116.0418 1144.2252 1157.6343 1172.7830 1201.0317 1223.0161 1237.1907 1251.8006 1276.4443 1305.9122 1327.9632 1351.6829 1366.6919 1367.8398 1382.7706 1399.6633 1432.6453 1436.3914 1450.7693 1459.1121 1461.3974 1468.9032 1477.4122 1495.0330 1572.2071 1594.7209 2815.6104 2868.4520 2966.3449 2969.5569 2988.8895 3028.9408 3030.1736 3059.8111 3077.9652 3085.3111 3122.4805 3176.2461 3182.1317 3450.3319
redmass: 5.1180 3.5159 2.3609 2.9130 2.7406 5.4076 2.5544 1.7890 3.9485 2.9284 3.8322 3.6099 4.0225 2.8099 3.4748 2.7619 3.5229 3.0415 3.0647 2.4913 2.9505 5.7158 3.7497 3.3938 3.4250 1.5124 3.0268 1.6048 1.5476 2.6767 2.0552 1.5292 2.5093 3.0145 2.0171 1.6794 1.6844 1.9741 1.6760 1.6979 3.6006 1.5549 2.1500 1.5386 1.4935 1.3870 1.1649 1.3487 1.7277 1.3877 1.5375 2.9938 1.5346 2.2757 1.1034 1.1555 1.1969 1.3357 1.1197 1.4186 1.3244 1.0628 8.1109 6.9575 1.0809 1.0570 1.0663 1.0624 1.0646 1.0965 1.0761 1.0966 1.0993 1.1008 1.0896 1.0949 1.0929 1.0746
irintensity: 0.5137 1.1558 1.4854 2.9433 1.0788 0.3693 1.4034 4.6036 1.3217 7.2751 5.1812 1.5961 1.1552 1.9816 30.6480 8.3273 14.0146 22.9996 11.8451 19.5583 32.2050 3.2746 6.3974 7.6443 6.0263 42.9858 17.8006 3.7230 21.6105 92.0366 38.0824 5.1211 20.5891 72.1220 16.4206 0.0503 7.5136 10.7422 13.2727 1.1131 40.4848 4.7262 60.8312 23.2206 13.6986 14.5180 3.2280 7.0809 39.1216 8.1227 11.8565 4.1219 2.5444 11.5843 8.9582 16.7848 39.7257 24.2060 7.0379 46.7569 28.5219 16.1926 38.9436 88.1166 82.3028 137.0375 45.6593 42.6815 72.1818 32.0780 32.4625 33.1207 38.2821 33.5234 10.9579 3.1019 0.1225 3.3122
temp: 298.150 k
press: 1.00000 atm
elementType: 17 8 7 6 6 6 6 6 6 6 6 6 6 6 1 1 1 1 1 1 1 1 1 1 1 1 1 1
symmnumber: 1
zpe: 599664.5 jmol-1
zpe.correction: 0.228400 hartree
zpe.thermalcorrener: 0.241605 hartree
zpe.thermalcorrenthalpy: 0.242549 hartree
zpe.thermalcorrgfe: 0.188567 hartree
zpe.sumelectzpe: -1016.524857 hartree
zpe.sumelectthermal: -1016.511652 hartree
zpe.sumelectthermalent: -1016.510708 hartree
zpe.sumelectthermalfe: -1016.564690 hartree
dipole: -4.0359 0.9170 1.9837
dipole: 4.5896
quadrupole: -88.8847 -82.8121 -92.4247
quadrupole: 1.2821 -1.2951 -0.3057
quadrupole: -0.8441 5.2284 -4.3842 1.2821 -1.2951 -0.3057
hfenergy: -1016.7532571 hartree
pointgroup: C01 [X(C11H14Cl1N1O1)]
dipole: 1.5505199 0.3859952 -0.8410543 debye
polarizability: 185.6018367|-5.3903388|127.5270623|-5.4501556|-12.9206218|95.2650401 unknown
InChI: InChI=1S/C11H14ClNO/c1-13-10-3-2-6-14-11-7-8(12)4-5-9(10)11/h4-5,7,10,13H,2-3,6H2,1H3
charge 0 multiplicity 1
28 atoms
Cl -4.490765 -0.318306 0.360827
O  0.452439 -1.679139 0.851931
N  2.07651 1.325497 0.675738
C  1.511024 0.856271 -0.612974
C  2.443495 -0.232518 -1.205566
C  2.707321 -1.43294 -0.274434
C  0.044828 0.440175 -0.43533
C  1.470038 -2.303131 -0.026841
C  -0.394584 -0.706343 0.291688
C  -0.956998 1.310574 -0.936418
C  -1.773202 -0.926576 0.539345
C  1.462632 2.533047 1.254349
C  -2.336959 1.104078 -0.720405
C  -2.717003 -0.018406 0.037699
H  1.494181 1.689618 -1.364604
H  3.411939 0.250613 -1.450868
H  2.014013 -0.584737 -2.163826
H  3.486601 -2.080484 -0.725818
H  3.088814 -1.082984 0.701791
H  0.987709 -2.587168 -0.985692
H  1.746427 -3.220058 0.52053
H  3.101219 1.39335 0.625447
H  -0.640137 2.197156 -1.499198
H  -2.068518 -1.812121 1.107455
H  1.4499 3.413041 0.564069
H  2.011108 2.819332 2.168885
H  0.418608 2.323018 1.544433
H  -3.083639 1.797741 -1.11511
