program: Gaussian 09
title: 000037755
version: EM64L-G09RevD.01
frameworkgroup: C1[X(C10H12ClNO)]
method: RPBEPBE
basis: SDD
operation: Freq
keyword: #p
keyword: freq=noraman
keyword: PBEPBE/SDD
title: #p freq=noraman PBEPBE/SDD
converged: YES YES NO NO
title: Mulliken charges:
elementType: Cl O N C C C C C C C C C C H H H H H H H H H H H H
charge: -0.063543 -0.299625 -0.564964 -0.322144 -0.371337 -0.409363 0.398152 -0.307489 0.201134 -0.435244 -0.344501 -0.238603 -0.087154 0.230925 0.224403 0.196522 0.206097 0.229816 0.199670 0.222802 0.238829 0.292131 0.269196 0.279182 0.255110
chargesum: 0.00000
title: Mulliken charges with hydrogens summed into heavy atoms:
elementType: Cl O N C C C C C C C C C C
charge: -0.063543 -0.299625 -0.003637 -0.091219 0.049587 0.026550 0.398152 0.114984 0.201134 -0.196415 -0.065319 0.016506 -0.087154
polarizability: 1.77327924e+02 -1.96534063e-01 1.20295089e+02 2.82715863e+00 -6.41853872e+00 7.88743871e+01
1716.lowfreq: -15.2193 -11.5499 -2.2636 0.0009 0.0010 0.0011 57.7902 98.5351 141.5191
frequency: 57.7369 98.5305 141.5127 171.9885 193.2081 232.5687 260.0105 291.0627 314.1542 330.6637 381.7142 399.9936 415.5587 473.7254 486.8211 543.0430 584.4124 599.2842 667.7803 695.8118 720.7283 750.5464 787.3937 812.8751 830.7689 870.4058 886.0283 915.5530 930.2676 946.8653 976.8985 1047.8065 1062.9180 1075.7108 1111.3892 1135.9025 1144.4630 1166.3991 1201.9326 1213.1610 1221.6142 1246.9358 1273.8666 1305.6503 1349.1719 1350.5892 1363.7490 1367.4109 1378.3401 1395.1111 1450.1630 1454.9870 1459.9157 1468.2076 1574.2852 1589.1968 1644.9311 2978.1557 2981.9414 2988.3230 3009.3947 3042.3280 3053.9499 3078.3883 3123.2661 3172.9894 3180.3381 3427.1412 3548.4164
redmass: 5.3086 4.0216 2.9835 6.1613 5.6826 4.1352 4.9455 1.3400 3.6174 1.8756 3.8901 2.9688 4.3885 3.2412 3.7967 2.9536 3.0642 4.5619 3.7997 2.9431 1.9499 3.0224 3.7648 1.7414 2.4257 1.6748 1.5978 2.5973 2.3088 1.4102 2.5735 2.4113 2.0198 1.6276 2.0961 1.5754 2.1747 1.7499 2.6654 1.3379 1.3905 1.3374 1.1648 1.5958 1.4412 1.3626 1.6356 1.4510 2.7866 2.7819 1.0868 1.5265 1.1370 1.4747 8.1076 7.0103 1.0892 1.0620 1.0636 1.0650 1.0850 1.0968 1.1000 1.1026 1.0897 1.0949 1.0931 1.0452 1.0960
irintensity: 0.6548 1.5872 0.9413 0.8421 0.2365 7.5303 0.5039 38.6698 3.7615 30.9608 1.7025 1.8491 4.3925 0.3626 14.6263 15.6842 13.8584 18.5646 20.5075 76.1829 134.5203 37.7033 8.8561 28.0524 19.3000 4.0935 22.3603 75.2891 64.8249 0.6279 108.6196 6.3998 16.1634 13.3843 19.0114 12.6462 16.4085 18.4412 30.0590 7.2060 21.0001 8.2157 2.3475 6.1527 10.2962 0.9244 10.9749 6.1453 2.5460 11.7746 10.7725 65.3710 0.9656 55.0974 25.5872 58.8657 42.4043 24.5502 22.4747 58.3473 37.5565 32.5524 44.1577 39.1894 11.4373 3.7703 0.1030 3.3416 2.3866
temp: 298.150 k
press: 1.00000 atm
elementType: 17 8 7 6 6 6 6 6 6 6 6 6 6 1 1 1 1 1 1 1 1 1 1 1 1
symmnumber: 1
zpe: 528787.4 jmol-1
zpe.correction: 0.201404 hartree
zpe.thermalcorrener: 0.213073 hartree
zpe.thermalcorrenthalpy: 0.214017 hartree
zpe.thermalcorrgfe: 0.163812 hartree
zpe.sumelectzpe: -977.314229 hartree
zpe.sumelectthermal: -977.302561 hartree
zpe.sumelectthermalent: -977.301617 hartree
zpe.sumelectthermalfe: -977.351821 hartree
dipole: 2.1039 0.6273 -1.2756
dipole: 2.5391
quadrupole: -91.6222 -76.9996 -83.9220
quadrupole: -5.8147 -3.3128 0.7338
quadrupole: -7.4409 7.1816 0.2592 -5.8147 -3.3128 0.7338
hfenergy: -977.5156338 hartree
pointgroup: C01 [X(C10H12Cl1N1O1)]
dipole: 0.8144135 0.2640658 -0.5146784 debye
dipolederiv: -0.8764393 -0.1761416 0.0234428 -0.2259446 -0.1849449 0.0223163 0.0228957 0.0279529 -0.0843366 -1.2575056 0.4449421 0.0668252 0.486535 -0.6653296 -0.055474 0.031048 0.0145846 -0.365608 -0.9231359 -0.2505255 -0.2062596 -0.1804686 -0.2763913 -0.0820325 -0.2013194 -0.1022284 -0.5482944 0.5366111 0.1461255 0.0294423 0.1421151 0.2507483 0.0206815 -0.0000319 0.0666149 0.4657083 -0.0031072 0.0111518 0.0476879 -0.0266321 0.0389451 -0.0212637 -0.0204395 -0.0143676 0.1041401 -0.0394934 -0.0335084 0.0435943 -0.0405128 -0.0136097 0.0263142 0.0803769 -0.0200745 0.066983 -0.0058345 0.0399342 0.0340051 0.2438026 -0.2329286 0.0012336 0.0393345 0.0764143 -0.1686008 0.8066397 -0.2242081 -0.1303927 -0.0725403 0.3329765 0.072894 -0.3614611 0.2330293 0.4017622 0.7741826 -0.3894792 0.0105431 -0.5806863 0.552374 -0.0455841 0.2653604 -0.1870938 0.0161847 0.048058 -0.0213558 -0.0218375 -0.0554438 0.0810461 -0.0666465 0.0020623 -0.0773397 -0.1278811 -0.4895734 0.1004197 0.0116674 -0.0403903 -0.0966226 -0.0399915 0.0398366 -0.0344099 -0.0907984 -0.3400294 -0.1096212 0.0386921 -0.1330292 -0.1133449 -0.0150208 0.0451871 -0.0033106 -0.1007923 1.2067512 0.2355161 -0.0347263 0.350048 0.2684742 -0.0807026 -0.0379836 -0.0923533 -0.043354 0.0278776 0.0556168 -0.0302606 -0.0099354 -0.1569657 0.0558772 0.0013695 0.0414608 0.007188 -0.1527986 -0.1005238 0.0495305 -0.083938 -0.0260208 0.0202685 0.019497 0.0075655 0.0867531 0.0501792 0.0336615 -0.1084986 0.0242714 0.0316863 -0.0303975 -0.0721571 -0.0068256 -0.1464962 -0.0773838 0.0840752 0.105867 0.0710263 0.0066283 -0.0603119 0.1502384 -0.0846223 -0.0055261 0.0597628 -0.0252703 -0.0665954 -0.0552187 0.0558137 0.0176117 -0.1303795 0.0346029 -0.0908123 -0.055351 -0.0239904 -0.0835727 -0.0072795 0.0742048 0.0172688 0.0111464 -0.0971616 -0.1350295 -0.020728 0.0804166 0.0232827 0.0827841 -0.1507506 0.0289258 0.022912 0.0640774 0.0595103 0.0492785 -0.0779544 0.0202581 -0.038597 -0.0754121 0.0578224 -0.0020209 0.052378 0.1214041 0.3556577 -0.0533958 0.0655813 -0.0234476 0.0686495 0.0786131 0.0485201 0.0426487 0.1700029 0.2245884 0.2061883 0.1459993 0.1319539 0.1700079 -0.0075449 0.0769782 -0.0223177 0.0979711 0.101874 -0.0214835 -0.0021688 -0.0258299 0.0107569 0.0435573 -0.0043607 0.037909 0.1548712 -0.0000809 0.0694101 -0.0321066 0.0673577 0.0500091 0.0415853 -0.0266093 0.0428667 0.1550508 unknown
polarizability: 177.3481637|1.3998253|120.1635771|1.8563442|-6.8748192|78.9856592 unknown
InChI: InChI=1S/C10H12ClNO/c11-7-3-4-8-9(12)2-1-5-13-10(8)6-7/h3-4,6,9H,1-2,5,12H2
charge 0 multiplicity 1
25 atoms
Cl -4.345144 -0.617727 0.064466
O  0.732322 -1.533961 0.64572
N  2.067482 1.268635 1.383088
C  1.556629 1.255205 -0.014025
C  2.553418 0.498917 -0.934416
C  2.91916 -0.925292 -0.465661
C  0.108039 0.747109 -0.108064
C  1.735111 -1.899079 -0.397447
C  -0.244699 -0.582829 0.259814
C  -0.945925 1.630369 -0.447934
C  -1.591383 -1.002449 0.320107
C  -2.303923 1.236565 -0.408318
C  -2.60045 -0.080127 -0.011317
H  1.552382 2.30697 -0.358789
H  3.481167 1.099484 -0.972194
H  2.135598 0.464031 -1.960864
H  3.663057 -1.356021 -1.166582
H  3.41401 -0.879609 0.522604
H  1.218995 -1.970886 -1.376212
H  2.073526 -2.904162 -0.093276
H  -0.702924 2.660345 -0.736945
H  2.003197 0.343036 1.826918
H  1.604759 1.977986 1.963714
H  -1.820405 -2.029084 0.616811
H  -3.103101 1.935274 -0.669998
