program: Gaussian 09
title: 000037751
version: EM64L-G09RevD.01
frameworkgroup: C1[X(C10H12ClNO2)]
method: RPBEPBE
basis: SDD
operation: Freq
keyword: #p
keyword: freq=noraman
keyword: PBEPBE/SDD
title: #p freq=noraman PBEPBE/SDD
converged: YES YES NO NO
title: Mulliken charges:
elementType: Cl O O N C C C C C C C C C C H H H H H H H H H H H H
charge: -0.067701 -0.264094 -0.255469 -0.618711 -0.399773 -0.294283 -0.502281 0.393831 0.235684 -0.374671 -0.363167 -0.043829 -0.198000 -0.252445 0.225055 0.264297 0.206742 0.201986 0.231855 0.207322 0.280227 0.250668 0.228716 0.256586 0.337960 0.313493
chargesum: 0.00000
title: Mulliken charges with hydrogens summed into heavy atoms:
elementType: Cl O O N C C C C C C C C C C
charge: -0.067701 -0.264094 -0.255469 0.032742 0.089579 0.114445 -0.063104 0.393831 0.235684 -0.094444 -0.112499 -0.043829 0.030717 0.004141
polarizability: 1.94387625e+02 -7.62221416e+00 1.28083827e+02 4.40924620e+00 -1.61282052e+00 7.18408480e+01
1716.lowfreq: -6.4352 -4.7303 0.0002 0.0008 0.0015 7.5691 25.3021 28.6677 47.2489
frequency: 25.1744 28.5740 47.1897 61.7915 107.8621 134.0559 153.0123 178.7297 191.1497 232.5923 278.3537 332.1157 380.0142 428.1535 440.1731 469.2285 499.1669 529.6129 563.5737 577.4266 609.6922 667.3175 677.6088 679.0767 764.1519 773.8983 816.1620 856.6555 864.8106 871.9540 879.0878 958.9919 976.5912 988.1157 1037.8137 1060.9363 1062.5657 1090.8866 1093.8351 1097.2931 1167.8705 1176.8425 1215.6640 1251.2582 1265.8480 1278.2693 1280.2777 1318.6957 1367.3431 1375.8132 1391.1656 1431.6459 1448.1972 1457.9734 1475.9365 1489.7509 1577.4566 1597.0261 1605.0050 1647.2922 2941.1190 2972.2165 2999.2757 3019.1501 3028.5879 3091.2368 3141.6415 3171.9638 3181.5432 3184.0967 3516.4825 3673.2763
redmass: 5.5531 6.0126 6.0622 3.6888 2.3394 2.4253 5.5291 7.9139 4.5762 5.0434 5.1582 4.2667 9.5335 2.8089 3.0747 3.6388 1.4134 1.7868 5.1092 4.0795 2.1420 3.9480 2.2319 2.9212 1.3337 1.2412 5.5841 2.2076 1.6711 1.5129 1.4477 1.3160 5.5899 7.2986 1.9143 2.6823 2.0648 1.7919 2.1699 1.7931 1.1973 1.1140 3.3760 1.3614 1.2505 1.3602 1.1609 1.5851 2.1643 3.2436 2.0905 3.0088 1.0914 2.2292 1.1195 1.1084 7.0859 1.4202 6.2954 3.7953 1.0549 1.0593 1.1062 1.0660 1.0956 1.1036 1.0877 1.0922 1.0950 1.0958 1.0447 1.1042
irintensity: 8.8102 2.9592 0.1748 3.0480 0.8440 2.3982 4.4647 0.3965 0.4413 0.6255 4.3179 11.0054 8.1918 4.0416 6.3460 3.6164 73.8188 120.0704 0.2152 31.0227 54.2483 8.8609 21.3359 43.7376 69.6852 3.6257 43.6844 11.1413 7.9529 31.7151 6.5309 0.5983 2.0862 180.3105 3.7986 2.9010 18.1667 14.1141 3.3002 2.3768 3.4743 14.2591 181.3927 5.4553 24.4206 51.2851 11.5872 51.2974 134.3804 26.4146 23.6239 7.7299 12.0801 136.6898 4.4990 11.5825 50.4343 98.8961 158.9130 285.7708 36.1094 22.4353 34.9090 14.7740 22.4109 26.9128 11.0175 10.6131 1.8824 4.0747 32.5814 23.0476
temp: 298.150 k
press: 1.00000 atm
elementType: 17 8 8 7 6 6 6 6 6 6 6 6 6 6 1 1 1 1 1 1 1 1 1 1 1 1
symmnumber: 1
zpe: 533685.9 jmol-1
zpe.correction: 0.203270 hartree
zpe.thermalcorrener: 0.217463 hartree
zpe.thermalcorrenthalpy: 0.218407 hartree
zpe.thermalcorrgfe: 0.159356 hartree
zpe.sumelectzpe: -1052.483142 hartree
zpe.sumelectthermal: -1052.468949 hartree
zpe.sumelectthermalent: -1052.468005 hartree
zpe.sumelectthermalfe: -1052.527057 hartree
dipole: -3.8342 5.4920 -2.2815
dipole: 7.0759
quadrupole: -79.6109 -87.6718 -92.4705
quadrupole: -9.6089 15.3617 2.2724
quadrupole: 6.9735 -1.0874 -5.8861 -9.6089 15.3617 2.2724
hfenergy: -1052.6864121 hartree
pointgroup: C01 [X(C10H12Cl1N1O2)]
dipole: 1.3888306 2.3474211 0.5574201 debye
dipolederiv: -0.5335585 -0.3189994 0.0882017 -0.383283 -0.4574427 0.0982276 0.1038606 0.0964593 -0.1053404 -2.1043263 -0.0086062 0.0697986 0.0962542 -0.3039076 0.003619 0.0517783 0.0073519 -0.2806534 -0.7193878 0.0903585 0.0200479 -0.0566686 -0.8373372 -0.3056505 -0.0843985 -0.2710649 -0.5484677 -1.0246135 -0.4196734 -0.2678981 -0.2526044 -0.5091259 0.0615367 -0.2216055 0.0381022 -0.718468 0.0014628 0.0020104 -0.0048021 0.0394716 0.0161304 -0.0223741 0.0273685 -0.0277218 0.1084755 1.0299043 0.1145011 -0.0419811 0.4535058 0.3143561 0.0087811 -0.1232564 0.0236329 0.4061066 -0.3681937 0.1188431 0.0226408 0.2933465 -0.0418086 -0.0086012 -0.0156294 -0.0029589 0.1803589 1.6923388 -0.1263944 -0.0319053 -0.4707687 0.1994891 -0.0013297 0.0309485 -0.0117281 0.1201073 1.4635341 0.1543323 0.3135937 0.0312907 0.9999156 0.5003744 0.3787014 0.4827563 0.5635271 -0.6736865 -0.040507 0.0281262 -0.2730043 -0.1377853 0.0093449 0.0804076 0.0017333 -0.1522886 -0.3663731 -0.0184134 0.0072452 0.397239 -0.1393451 -0.0341184 -0.0815742 -0.0202751 -0.2184001 0.8965195 0.3841013 -0.12319 0.5054736 0.7633624 -0.1976738 -0.1508365 -0.1926379 0.0027178 0.2831879 0.1330785 -0.0463977 -0.0570644 0.140045 -0.0555904 -0.0048369 -0.0640572 -0.110393 -0.2788017 -0.1729113 0.0414054 -0.1407433 -0.3759081 0.0530244 0.0365804 0.0540338 -0.1761474 0.0585124 -0.0126513 -0.0049067 0.0039792 0.0379822 0.079233 -0.0052444 0.0895949 -0.0840735 0.1230368 -0.0042688 0.0001627 -0.0153439 0.0121433 -0.0671915 -0.0268007 -0.0708558 0.0164571 -0.0369313 0.0109209 -0.0302317 -0.0936371 -0.0110435 0.0846143 0.0240795 0.0951873 -0.1281082 -0.043633 0.0114182 0.0205746 -0.1055704 -0.0963912 -0.0927297 0.0207811 -0.1127779 -0.0496785 0.0811725 0.0293061 -0.0248232 0.0008965 0.0171339 0.0722988 0.0050753 0.0992657 -0.0594943 0.0146367 -0.0168224 -0.0224337 -0.0395865 -0.0430719 -0.1136741 -0.0118459 -0.1430634 -0.0478835 0.1093625 0.0328854 -0.0035126 0.0348406 0.0235985 0.0326282 -0.004906 0.0321973 0.1730822 -0.0042295 -0.0972478 0.0291998 -0.1164808 0.0260562 0.036251 0.0331325 0.0362887 0.1626243 0.0522655 0.0354215 -0.0034783 0.0528509 -0.0916466 0.0517536 -0.0071511 0.0521265 0.144017 -0.045516 0.0383236 0.001596 0.0252638 0.0954976 0.0174123 0.0044535 0.016602 0.17703 0.1633319 0.0365767 -0.0205274 0.0276813 0.2156318 -0.0969384 -0.0476072 -0.0929378 0.3223146 0.229985 0.0444179 -0.0165048 0.0426618 0.1834717 -0.1132274 -0.0114743 -0.1152534 0.3025781 unknown
polarizability: 192.9981314|12.2200322|129.1046798|-3.5878893|-5.4080052|72.2094895 unknown
InChI: InChI=1S/C10H12ClNO2/c11-8-3-1-4-9(7-8)14-6-2-5-10(12)13/h1,3-4,7H,2,5-6,12H2
charge 0 multiplicity 1
26 atoms
Cl -5.093464 -1.829587 0.614764
O  -0.160974 -0.434057 0.097878
O  4.822959 -1.210164 -0.977675
N  5.880712 0.451812 0.243609
C  2.237864 -0.240045 -0.024137
C  0.924575 0.53449 -0.143723
C  3.459056 0.688837 -0.202432
C  -1.480276 0.03293 0.051547
C  4.761097 -0.116414 -0.345198
C  -2.470514 -0.950906 0.30765
C  -1.853502 1.373456 -0.223618
C  -3.817659 -0.564825 0.283501
C  -3.224713 1.718048 -0.238295
C  -4.228416 0.758065 0.014836
H  2.277936 -0.738093 0.961788
H  2.280045 -1.034385 -0.789115
H  0.813328 0.974717 -1.157352
H  0.863918 1.351079 0.607157
H  3.342197 1.279254 -1.134934
H  3.532591 1.413823 0.631594
H  -2.164593 -1.978934 0.516133
H  -1.102197 2.141445 -0.425259
H  -3.516134 2.75224 -0.451197
H  -5.288068 1.025012 0.003629
H  6.776636 -0.026144 0.144894
H  5.836296 1.321242 0.771659
