program: Gaussian 09
title: 000037749
version: EM64L-G09RevD.01
frameworkgroup: C1[X(C17H17BrN2O)]
method: RPBEPBE
basis: SDD
operation: Freq
keyword: #p
keyword: freq=noraman
keyword: PBEPBE/SDD
title: #p freq=noraman PBEPBE/SDD
converged: YES YES NO NO
title: Mulliken charges:
elementType: Br O N N C C C C C C C C C C C C C C C C C H H H H H H H H H H H H H H H H H
charge: 0.030121 -0.214563 -0.079427 -0.470300 -0.521681 0.062750 -0.409963 -0.488275 0.338891 0.331993 -0.417731 -0.623205 -0.380940 -0.240014 0.112666 0.336281 -0.378883 -0.370459 -0.201764 -0.226385 -0.221255 0.237950 0.200154 0.220239 0.193515 0.191473 0.236962 0.232894 0.229390 0.226443 0.188349 0.307457 0.227929 0.344990 0.262819 0.254024 0.237742 0.239814
chargesum: 0.00000
title: Mulliken charges with hydrogens summed into heavy atoms:
elementType: Br O N N C C C C C C C C C C C C C C C C C
charge: 0.030121 -0.214563 -0.079427 -0.125310 -0.083578 0.062750 0.003792 -0.059840 0.338891 0.331993 -0.184837 0.020977 -0.073483 -0.012085 0.112666 0.336281 -0.378883 -0.107640 0.052259 0.011356 0.018559
polarizability: 2.94113827e+02 -2.08169276e+01 2.29190659e+02 -5.00085404e+00 -7.57997022e+00 1.45163046e+02
1716.lowfreq: -8.4150 -5.2357 -1.0726 -0.0003 0.0006 0.0006 12.3041 27.9167 47.8143
frequency: 11.8113 27.9029 47.7794 55.9772 85.2194 104.3286 115.3013 129.6270 170.5539 194.6962 204.9409 224.0743 235.3312 252.3939 287.7937 294.2028 319.1978 328.3201 340.3126 385.2012 407.3270 436.9106 454.1769 476.8193 494.3403 526.1970 560.7490 579.2924 619.1747 633.8384 659.3791 662.7144 697.1923 720.0537 727.3545 745.3025 770.6756 796.1108 798.9043 809.2418 868.0491 877.0468 908.0476 914.6177 955.5743 968.2370 988.2918 991.2233 993.5740 997.1792 1010.8534 1038.0555 1045.4078 1072.7392 1083.5743 1109.2696 1114.4362 1127.8054 1142.0180 1175.6258 1178.9541 1189.6256 1194.5885 1217.2266 1234.4365 1242.6256 1263.9315 1266.1274 1289.5478 1295.2400 1331.3637 1346.5666 1363.7324 1375.5381 1383.3761 1413.5441 1428.2101 1437.5476 1448.9564 1452.8760 1455.7500 1462.3315 1464.7387 1477.9352 1480.6749 1517.8208 1565.8424 1593.3028 1602.8063 1608.2226 1618.6943 2796.6805 2835.8308 2857.5250 2946.1367 2997.2344 3007.3712 3020.1608 3036.2443 3078.8149 3120.2603 3130.7132 3143.8764 3150.6972 3160.8884 3175.1211 3197.1941 3534.2066
redmass: 7.1004 6.2122 4.7958 4.2813 2.9861 4.9378 4.3252 5.6897 4.7199 2.8989 3.4098 1.5284 2.6105 4.7078 5.5520 2.6758 4.1434 2.3630 5.7552 5.1484 3.8622 4.3594 3.9673 3.2304 4.0713 4.7001 3.3964 4.2876 3.6656 6.0958 4.0643 1.3369 6.5789 2.7236 5.7920 2.5411 1.6416 1.4443 2.6562 4.2468 4.4240 1.5567 2.4330 1.3692 1.4179 2.6301 1.4855 1.3522 1.7394 2.6151 6.2843 2.4771 1.8751 2.1939 1.9162 2.2151 1.4102 1.8787 2.1580 1.0617 1.3003 1.2536 1.9949 1.6267 1.9289 1.9819 1.5190 1.7794 2.6393 1.5518 1.6466 1.5178 9.0300 2.1125 2.3665 2.0973 1.2742 2.2403 1.1413 2.2267 1.2476 1.4727 1.3259 1.1392 1.0694 2.1954 5.9035 6.8186 7.1593 8.5014 4.3091 1.0711 1.0693 1.0583 1.0583 1.1003 1.0852 1.0726 1.0891 1.1010 1.0881 1.0871 1.0896 1.0950 1.0948 1.0999 1.0950 1.0757
irintensity: 0.1733 1.0089 0.9136 0.4876 0.7650 3.5063 0.1403 0.3321 1.6487 1.2598 1.5978 0.2941 2.4531 3.5089 11.3464 6.5978 0.6707 2.0830 3.1385 6.2861 0.5818 0.3131 6.2861 4.1765 6.5051 1.8820 3.1447 14.2557 8.0650 7.1024 12.0125 57.9602 11.4898 5.3756 4.0155 27.5167 50.4373 54.2020 10.9232 10.8730 16.0840 6.1996 10.3189 2.7344 3.6008 4.4466 4.0709 0.4460 3.9132 3.8468 58.7093 3.7219 10.4523 15.8321 3.7403 20.9962 9.6008 19.9091 25.2574 0.3186 4.4378 1.1478 1.7530 3.1212 16.2458 66.1573 13.0828 15.9779 50.8045 12.2462 0.6278 0.4674 3.8141 93.1218 54.4374 22.6465 4.5731 89.0034 20.5572 76.9688 26.0657 59.4121 74.5652 5.6826 12.4275 322.9314 11.5607 11.9798 98.9910 56.5962 56.3969 67.9281 57.4832 217.3657 37.3668 27.8016 23.0858 49.3082 40.2168 30.1441 9.4360 3.3001 6.4101 26.5554 12.7144 16.4563 6.9737 28.8493
temp: 298.150 k
press: 1.00000 atm
elementType: 35 8 7 7 6 6 6 6 6 6 6 6 6 6 6 6 6 6 6 6 6 1 1 1 1 1 1 1 1 1 1 1 1 1 1 1 1 1
symmnumber: 1
zpe: 790512.9 jmol-1
zpe.correction: 0.301090 hartree
zpe.thermalcorrener: 0.319996 hartree
zpe.thermalcorrenthalpy: 0.320940 hartree
zpe.thermalcorrgfe: 0.251241 hartree
zpe.sumelectzpe: -854.695540 hartree
zpe.sumelectthermal: -854.676635 hartree
zpe.sumelectthermalent: -854.675691 hartree
zpe.sumelectthermalfe: -854.745390 hartree
dipole: 2.3171 4.9709 1.0560
dipole: 5.5852
quadrupole: -115.6843 -125.5929 -134.4126
quadrupole: -12.9852 3.7952 -2.3551
quadrupole: 9.5456 -0.3629 -9.1827 -12.9852 3.7952 -2.3551
hfenergy: -854.996631 hartree
pointgroup: C01 [X(C17H17Br1N2O1)]
dipole: -0.6934124 2.0601365 0.321662 debye
polarizability: 296.5697524|17.4106398|212.5728952|-11.4065778|29.5252095|159.3248853 unknown
InChI: InChI=1S/C17H17BrN2O/c1-20-10-9-13-12(11-20)5-4-8-16(13)19-17(21)14-6-2-3-7-15(14)18/h2-8,19H,9-11H2,1H3
charge 0 multiplicity 1
38 atoms
Br 4.002107 -1.081524 -2.345269
O  1.90767 -2.302038 -0.050538
N  -4.151892 1.680897 0.243329
N  0.490231 -0.418057 0.05674
C  -1.724764 1.408505 -0.131885
C  -1.930263 -0.100484 -0.040474
C  -3.006942 2.144313 -0.566454
C  -4.465215 0.267368 -0.051453
C  -3.239844 -0.637312 -0.006936
C  -0.814432 -0.995907 0.025888
C  -3.43186 -2.039468 0.054704
C  -5.340641 2.543022 0.116354
C  -1.009849 -2.398938 0.078118
C  -2.324567 -2.909282 0.087762
C  1.733484 -1.052861 0.040087
C  2.887929 -0.081335 0.197849
C  3.983062 -0.018463 -0.69939
C  2.921671 0.752125 1.349791
C  5.076328 0.841555 -0.463996
C  4.01144 1.61233 1.601033
C  5.091488 1.65543 0.691659
H  -1.409787 1.807209 0.85476
H  -0.927721 1.656758 -0.864817
H  -2.881512 3.231652 -0.413014
H  -3.180848 1.97913 -1.662342
H  -4.947471 0.164208 -1.062698
H  -5.207684 -0.088115 0.68834
H  -4.451089 -2.443723 0.079598
H  -5.085974 3.576711 0.409945
H  -6.13499 2.182072 0.794389
H  -5.760686 2.568526 -0.921816
H  -0.143527 -3.061173 0.10679
H  -2.477612 -3.992972 0.131279
H  0.527859 0.603398 0.065259
H  2.096639 0.692767 2.069213
H  5.904498 0.876922 -1.177611
H  4.020769 2.234907 2.501538
H  5.945893 2.315649 0.873869
