program: Gaussian 09
title: 000037748
version: EM64L-G09RevD.01
frameworkgroup: C1[X(C17H17ClN2O)]
method: RPBEPBE
basis: SDD
operation: Freq
keyword: #p
keyword: freq=noraman
keyword: PBEPBE/SDD
title: #p freq=noraman PBEPBE/SDD
converged: YES YES NO NO
title: Mulliken charges:
elementType: Cl O N N C C C C C C C C C C C C C C C C C H H H H H H H H H H H H H H H H H
charge: -0.023630 -0.217537 -0.079496 -0.471495 -0.521531 0.061734 -0.409968 -0.487716 0.338310 0.331264 -0.417312 -0.623285 -0.381065 -0.239447 0.125694 0.345063 -0.314480 -0.373578 -0.227944 -0.230346 -0.216315 0.237862 0.199388 0.220133 0.193524 0.191490 0.236968 0.232837 0.229286 0.226466 0.188361 0.307621 0.227822 0.344009 0.261102 0.259475 0.237762 0.238975
chargesum: 0.00000
title: Mulliken charges with hydrogens summed into heavy atoms:
elementType: Cl O N N C C C C C C C C C C C C C C C C C
charge: -0.023630 -0.217537 -0.079496 -0.127486 -0.084281 0.061734 0.003689 -0.059258 0.338310 0.331264 -0.184475 0.020828 -0.073444 -0.011625 0.125694 0.345063 -0.314480 -0.112476 0.031531 0.007416 0.022660
polarizability: 2.92056569e+02 -2.11030570e+01 2.17634426e+02 7.16511583e+00 9.97415941e+00 1.38173676e+02
1716.lowfreq: -10.5651 -0.7802 -0.0014 -0.0012 -0.0006 3.3115 17.8483 30.9160 47.1478
frequency: 17.7628 30.7835 47.1069 59.8465 89.9475 108.6274 122.3029 148.5651 178.1582 200.6722 211.5043 229.2500 241.4910 256.9064 297.4873 307.7379 329.2076 352.2252 358.2991 407.8433 413.2710 437.7806 460.2262 477.0917 495.7683 528.7268 560.5247 579.3098 619.4639 636.8639 652.5156 671.3294 697.1624 720.0259 733.3160 747.3404 770.3185 796.3460 798.4854 809.4270 868.0731 876.1218 907.3717 914.5380 954.3636 968.1784 987.5516 989.6189 993.2463 998.0476 1023.7771 1037.6795 1045.2044 1072.2417 1083.1710 1112.8380 1116.3698 1129.3633 1142.4373 1175.0234 1179.4012 1190.0490 1194.0845 1216.0718 1234.8068 1242.4722 1265.6204 1267.0938 1289.0146 1294.4782 1331.1223 1348.1197 1368.6299 1375.9455 1383.2215 1416.7744 1429.4530 1439.0706 1448.7319 1456.4259 1458.8266 1463.5372 1465.0031 1479.3918 1481.5391 1517.9892 1569.4923 1598.6677 1603.6803 1609.0784 1619.4163 2798.8415 2837.8985 2859.2725 2947.1642 2998.5162 3007.2093 3020.2099 3036.7989 3078.5364 3120.2399 3132.2189 3145.5624 3150.5983 3162.4014 3176.6802 3197.3694 3533.3210
redmass: 6.7590 5.9637 4.8912 4.4560 3.1361 3.8375 4.5420 7.2843 4.8396 2.8013 3.9132 1.4095 2.7769 4.6005 2.5758 3.6137 2.3000 5.8637 6.7020 3.8170 6.4869 4.3572 4.2251 3.2104 4.0631 4.8032 3.2601 4.2936 3.6515 5.6765 1.2551 5.6793 6.4074 2.7160 6.0066 2.6049 1.6305 1.4381 2.7098 4.2468 4.0031 1.6134 2.4258 1.3719 1.4089 2.6142 1.4544 1.3441 1.7780 2.5350 6.2694 2.4685 1.8884 2.1619 1.9267 2.0964 1.5347 1.7414 2.1546 1.0612 1.2903 1.3615 1.8206 1.5991 1.8705 2.0570 1.5330 1.7834 2.6190 1.5825 1.6332 1.5011 8.8278 2.0852 2.4416 2.1442 1.2852 2.2113 1.1259 1.3632 2.0766 1.5212 1.2601 1.1504 1.0608 2.2140 6.0295 6.9868 7.2103 8.2428 4.4272 1.0712 1.0693 1.0582 1.0584 1.1003 1.0852 1.0728 1.0890 1.1009 1.0881 1.0872 1.0897 1.0951 1.0949 1.0999 1.0950 1.0758
irintensity: 0.5564 1.1375 0.7761 1.0006 1.0345 2.1285 0.3285 0.7681 1.2744 1.2927 1.6917 0.4631 3.1351 3.2679 12.7847 2.5902 1.3488 2.7184 4.7736 0.7143 6.9969 0.3711 5.8604 3.9414 5.8640 1.9283 3.7653 12.9278 7.9282 6.8343 50.5319 18.7204 10.6768 5.6800 6.6935 28.8346 51.2809 49.2420 16.1719 11.5513 15.5245 6.4356 9.7492 2.7207 3.8520 5.1832 3.3329 0.1824 4.6261 0.7708 51.0593 6.1214 10.2997 16.6133 4.0589 21.9478 17.6600 10.8205 26.3472 0.8762 4.4646 2.2899 1.1682 3.6111 12.3577 63.6039 11.4183 21.8140 51.8540 10.8393 0.6852 0.5104 3.1600 89.2555 57.2612 20.6606 4.3002 89.8164 25.5575 72.6574 18.1509 61.6622 68.1456 12.7350 6.5674 325.7328 8.4596 21.5818 92.0187 48.4326 64.7745 68.2338 58.4212 217.8975 37.1280 27.7195 23.8219 48.6953 40.1355 30.1276 9.4442 3.0799 7.2444 26.6933 11.9445 14.4437 6.9788 27.9820
temp: 298.150 k
press: 1.00000 atm
elementType: 17 8 7 7 6 6 6 6 6 6 6 6 6 6 6 6 6 6 6 6 6 1 1 1 1 1 1 1 1 1 1 1 1 1 1 1 1 1
symmnumber: 1
zpe: 792144.9 jmol-1
zpe.correction: 0.301712 hartree
zpe.thermalcorrener: 0.320341 hartree
zpe.thermalcorrenthalpy: 0.321285 hartree
zpe.thermalcorrgfe: 0.253199 hartree
zpe.sumelectzpe: -1301.296497 hartree
zpe.sumelectthermal: -1301.277869 hartree
zpe.sumelectthermalent: -1301.276924 hartree
zpe.sumelectthermalfe: -1301.345010 hartree
dipole: -2.0162 -5.2765 0.2426
dipole: 5.6538
quadrupole: -112.3988 -126.6792 -132.1411
quadrupole: -14.6697 -4.7834 0.6396
quadrupole: 11.3409 -2.9395 -8.4014 -14.6697 -4.7834 0.6396
hfenergy: -1301.5982094 hartree
pointgroup: C01 [X(C17H17Cl1N2O1)]
dipole: -0.658218 2.0944496 0.35764 debye
polarizability: 293.8944773|18.4121236|208.1452437|-8.1120212|24.2190666|145.82495 unknown
InChI: InChI=1S/C17H17ClN2O/c1-20-10-9-13-12(11-20)5-4-8-16(13)19-17(21)14-6-2-3-7-15(14)18/h2-8,19H,9-11H2,1H3
charge 0 multiplicity 1
38 atoms
Cl 4.00145 -1.037123 -2.215676
O  1.907202 -2.300869 -0.079844
N  -4.152629 1.679924 0.255843
N  0.488856 -0.418229 0.042302
C  -1.726689 1.409327 -0.127085
C  -1.931826 -0.100276 -0.044892
C  -3.01007 2.147216 -0.554715
C  -4.466904 0.267804 -0.043539
C  -3.2413 -0.637142 -0.010101
C  -0.815584 -0.995909 0.011633
C  -3.433259 -2.039659 0.042281
C  -5.341605 2.54247 0.137396
C  -1.011123 -2.399262 0.054604
C  -2.32587 -2.909605 0.06541
C  1.732731 -1.05274 0.021315
C  2.886233 -0.083257 0.188647
C  3.98765 -0.032213 -0.698412
C  2.920566 0.758887 1.33372
C  5.088076 0.816919 -0.469048
C  4.016444 1.612598 1.582882
C  5.10275 1.640296 0.679591
H  -1.41018 1.802132 0.861353
H  -0.931383 1.6623 -0.860206
H  -2.884098 3.233786 -0.396478
H  -3.186577 1.987348 -1.650852
H  -4.954971 0.168709 -1.052212
H  -5.204797 -0.09134 0.699103
H  -4.452404 -2.444089 0.067564
H  -5.085782 3.575037 0.433944
H  -6.13317 2.179293 0.817519
H  -5.766241 2.572145 -0.898687
H  -0.145171 -3.062169 0.075605
H  -2.478873 -3.993558 0.101349
H  0.525874 0.6031 0.057662
H  2.092309 0.712515 2.050247
H  5.917732 0.834267 -1.181564
H  4.025984 2.242585 2.478159
H  5.960745 2.295484 0.86258
