program: Gaussian 09
title: 000037741
version: EM64L-G09RevD.01
frameworkgroup: C1[X(C15H20ClNO)]
method: RPBEPBE
basis: SDD
operation: Freq
keyword: #p
keyword: freq=noraman
keyword: PBEPBE/SDD
title: #p freq=noraman PBEPBE/SDD
converged: YES YES NO NO
title: Mulliken charges:
elementType: Cl O N C C C C C C C C C C C C C C C H H H H H H H H H H H H H H H H H H H H
charge: -0.062230 -0.268442 -0.077647 -0.601365 -0.408038 0.413984 -0.337502 0.216340 -0.361004 -0.410800 0.175213 -0.340309 -0.354816 -0.354407 -0.614978 -0.626753 -0.305792 -0.091901 0.215115 0.211415 0.237486 0.221863 0.207145 0.172753 0.214229 0.241221 0.203947 0.225599 0.211149 0.242825 0.279587 0.224853 0.185533 0.222369 0.235109 0.220602 0.183084 0.254561
chargesum: 0.00000
title: Mulliken charges with hydrogens summed into heavy atoms:
elementType: Cl O N C C C C C C C C C C C C C C C
charge: -0.062230 -0.268442 -0.077647 -0.174835 0.051311 0.413984 0.042397 0.216340 -0.146775 0.034368 0.175213 0.096438 -0.111991 -0.074820 0.017778 0.012041 -0.051231 -0.091901
polarizability: 2.20476349e+02 -2.25533959e+01 2.29674995e+02 1.43030816e+01 3.67426862e+00 1.16886658e+02
1716.lowfreq: -11.4891 -6.1935 0.0009 0.0015 0.0020 5.0334 19.0353 27.6400 32.2992
frequency: 18.9525 27.3770 32.2647 59.5404 78.3251 95.5638 146.6180 155.8567 176.3570 190.1404 223.3343 231.5808 241.8955 260.3117 283.5679 301.1071 320.3090 342.0466 349.7320 380.7192 422.4439 430.7192 459.1464 464.9953 475.4683 552.7288 579.5705 603.9995 625.3767 676.6943 683.4611 737.3298 760.5041 798.1130 806.0564 816.0548 825.4159 854.3561 878.5479 880.3650 939.9367 945.6413 977.5082 1009.5157 1021.7401 1027.9222 1033.8908 1067.1170 1070.7330 1074.8274 1088.5376 1094.0268 1103.7882 1130.5270 1147.2733 1155.6579 1197.2746 1197.7678 1209.2877 1218.9568 1251.4367 1258.3066 1265.5826 1272.0317 1279.2130 1295.8504 1331.8235 1347.0152 1350.5642 1369.3984 1372.5299 1386.3638 1393.6747 1418.7618 1440.0305 1440.1540 1459.9989 1461.9896 1465.0128 1472.2712 1473.5838 1477.9003 1482.4820 1488.2412 1507.1465 1556.1796 1595.2075 1639.8214 2809.0683 2836.6536 2854.3025 2965.6695 2984.2774 2990.1476 2995.1720 3000.7911 3014.0837 3016.9314 3029.9204 3030.4003 3062.1001 3076.3817 3087.5854 3088.9608 3090.3063 3166.4999 3181.6179 3188.6960
redmass: 4.2499 3.6423 3.1043 4.1149 4.0551 2.6081 2.6018 3.1318 4.4063 4.6516 1.9996 1.3048 1.3357 3.8604 2.9079 4.3804 2.4829 2.5710 5.0913 3.1927 3.1818 2.6144 3.1522 4.2608 3.0729 5.2993 4.9262 3.8084 2.7835 4.6104 4.7615 3.1064 1.1142 2.3927 2.1307 3.0881 1.6582 1.5873 1.5098 2.0517 1.3526 2.2389 4.1156 2.9896 2.4875 2.6126 1.8322 2.0427 2.1150 2.3558 1.9308 1.3816 1.8587 1.4018 2.2223 1.6356 1.1749 1.8654 2.3668 1.7103 1.6132 1.4002 1.4306 1.4534 1.2664 1.2547 1.4591 1.6265 2.8442 2.1801 1.4101 1.8343 2.0524 1.1413 1.1640 1.0943 1.0687 1.0571 1.5700 1.3684 1.0706 1.0557 1.0897 1.0958 1.1134 8.3576 6.7618 7.2693 1.0698 1.0580 1.0579 1.0604 1.0603 1.0783 1.0724 1.0678 1.0884 1.0715 1.0912 1.0792 1.1037 1.1011 1.0985 1.1003 1.0937 1.0883 1.0926 1.0952
irintensity: 0.2206 0.1263 0.8012 1.8407 0.2411 1.1874 0.1041 0.7697 0.0207 0.3245 0.1658 0.7039 1.8429 0.4853 1.6389 10.3718 5.1848 3.2750 7.2529 0.2177 1.9660 0.5821 5.1637 12.3784 6.2955 3.6074 11.6686 3.4983 9.5375 0.5019 0.4213 2.3121 2.0549 3.4519 9.3904 29.5432 52.0490 4.9504 26.4349 17.2757 1.2059 5.2189 112.4935 22.0828 11.3552 1.6854 19.9144 6.9039 12.2176 24.2112 16.2282 5.3758 16.0096 2.1221 10.1135 10.0839 2.7518 23.4032 41.7649 1.7641 2.4289 5.8479 18.4872 14.4008 4.6218 12.1344 2.8315 20.8248 16.1307 9.2635 14.2859 15.5450 9.6805 2.7765 5.0564 14.8343 6.1880 21.7322 46.6988 41.9038 7.3751 8.7755 10.9258 16.9912 22.9845 43.0106 77.9962 0.9101 72.8251 70.5809 242.1086 42.3195 11.8287 6.0537 16.0288 57.1159 52.6767 43.9518 10.4584 37.5250 50.8075 38.1695 48.1843 32.2496 27.4117 2.5099 0.3575 8.0902
temp: 298.150 k
press: 1.00000 atm
elementType: 17 8 7 6 6 6 6 6 6 6 6 6 6 6 6 6 6 6 1 1 1 1 1 1 1 1 1 1 1 1 1 1 1 1 1 1 1 1
symmnumber: 1
zpe: 831291.1 jmol-1
zpe.correction: 0.316622 hartree
zpe.thermalcorrener: 0.334894 hartree
zpe.thermalcorrenthalpy: 0.335838 hartree
zpe.thermalcorrgfe: 0.268085 hartree
zpe.sumelectzpe: -1172.219503 hartree
zpe.sumelectthermal: -1172.201231 hartree
zpe.sumelectthermalent: -1172.200287 hartree
zpe.sumelectthermalfe: -1172.268040 hartree
dipole: -3.8664 2.8728 0.0737
dipole: 4.8174
quadrupole: -119.2028 -108.1160 -116.2850
quadrupole: 5.0302 3.4496 5.4003
quadrupole: -4.6682 6.4186 -1.7504 5.0302 3.4496 5.4003
hfenergy: -1172.5361247 hartree
pointgroup: C01 [X(C15H20Cl1N1O1)]
dipole: -1.4050068 1.2717188 -0.0294409 debye
polarizability: 215.7298038|-20.8136944|233.9466196|16.7649005|-1.3656291|117.3615784 unknown
InChI: InChI=1S/C15H20ClNO/c1-17(2)9-3-5-12-6-4-10-18-15-11-13(16)7-8-14(12)15/h6-8,11H,3-5,9-10H2,1-2H3
charge 0 multiplicity 1
38 atoms
Cl 4.124501 -3.38864 0.461541
O  2.96499 1.591904 0.36574
N  -4.556239 -0.895093 0.474121
C  -1.343039 0.587976 -1.148246
C  -2.311484 0.168843 -0.006332
C  0.013704 1.100834 -0.640446
C  -3.666913 -0.316049 -0.561168
C  1.03193 0.074978 -0.249555
C  0.147018 2.469002 -0.610945
C  1.262045 3.337405 -0.082349
C  2.388055 0.329136 0.160101
C  2.138169 2.655155 0.966991
C  0.690218 -1.310982 -0.371218
C  3.317416 -0.720388 0.366706
C  -5.709309 -1.597545 -0.126329
C  -4.987646 0.086225 1.49012
C  1.59278 -2.368282 -0.160797
C  2.916336 -2.049475 0.194679
H  -1.216121 -0.253378 -1.856988
H  -1.827295 1.397187 -1.726729
H  -1.875895 -0.638686 0.610476
H  -2.449171 1.040945 0.660786
H  -3.4780 -1.109452 -1.312037
H  -4.165046 0.531247 -1.107977
H  -0.70637 3.037813 -1.00792
H  1.912771 3.689871 -0.908577
H  0.820472 4.251981 0.365966
H  2.874756 3.358362 1.389397
H  1.52316 2.230552 1.783895
H  -0.326232 -1.583347 -0.660994
H  4.333269 -0.455056 0.669215
H  -5.349712 -2.379758 -0.818699
H  -6.396726 -0.920606 -0.697086
H  -6.299867 -2.089597 0.667312
H  -4.113754 0.500247 2.019987
H  -5.625767 -0.417725 2.237674
H  -5.570664 0.940551 1.056642
H  1.275761 -3.407656 -0.276959
