program: Gaussian 09
title: 000037734
version: EM64L-G09RevD.01
frameworkgroup: C1[X(C10H10O)]
method: RPBEPBE
basis: SDD
operation: Freq
keyword: #pfreq=noraman
keyword: PBEPBE/SDD
title: #p freq=noraman PBEPBE/SDD
converged: YES YES NO NO
title: Mulliken charges:
elementType: O C C C C C C C C C C H H H H H H H H H H
charge: -0.197984 0.521345 -0.705621 -0.387726 -0.390891 0.183529 -0.227256 -0.226587 -0.239209 -0.141786 -0.504608 0.245463 0.244231 0.226898 0.226700 0.223889 0.223819 0.226945 0.220478 0.224895 0.253473
chargesum: 0.00000
title: Mulliken charges with hydrogens summed into heavy atoms:
elementType: O C C C C C C C C C C
charge: -0.197984 0.521345 -0.215926 -0.160827 -0.164191 0.183529 -0.003367 -0.002768 -0.012264 0.078691 -0.026239
polarizability: 1.50256824e+02 7.73482104e-01 9.07004066e+01 -9.98193196e+00 1.55066324e-01 7.49503273e+01
1716.lowfreq: -23.6618 -8.2259 -3.6919 0.0000 0.0003 0.0006 2.9568 30.6700 74.6110
frequency: -23.6078 30.5803 74.5983 108.3771 214.1887 255.1983 318.2067 339.5839 401.0833 437.2748 473.0437 570.4109 617.2433 644.1054 652.4915 701.7887 745.6410 814.6798 834.1866 848.5945 920.0929 921.3122 971.5185 990.0706 993.4231 997.7822 1004.8290 1027.1507 1056.9584 1072.8911 1081.0749 1160.5001 1172.8250 1188.5533 1216.0610 1284.3323 1302.7278 1326.2088 1384.8555 1405.8455 1437.2713 1440.9441 1486.5137 1591.9381 1596.6986 1618.7451 1649.0919 2963.1327 3012.7279 3093.1513 3113.9870 3116.2917 3117.0983 3132.2258 3144.6959 3162.5729 3211.7897
redmass: 4.1328 4.7072 4.9709 2.3106 3.8487 5.0452 1.9754 4.4778 2.7958 1.8516 3.5987 4.7496 6.0745 3.1785 1.7518 1.7593 1.9682 4.0714 2.8026 1.2514 2.0313 1.6621 1.3914 4.6061 1.4227 1.3411 1.1196 2.2160 1.6931 2.7917 1.6027 1.1428 1.0515 1.1241 2.0676 1.5240 1.6263 1.2700 8.5521 1.2170 1.1338 2.1938 2.4152 7.7222 6.1401 6.1548 5.0339 1.0606 1.0976 1.0593 1.0941 1.0862 1.0877 1.0911 1.0960 1.1016 1.1160
irintensity: 1.6201 1.8019 2.5877 0.4367 0.2351 3.2086 1.2596 5.9272 0.0181 0.5385 7.0532 9.1059 0.0280 12.9397 10.1170 51.2455 37.0608 2.7739 9.8261 0.1128 4.8510 4.4753 0.0994 1.0395 0.2891 2.8542 73.7369 3.5704 43.6045 114.4666 10.6703 0.7602 0.1750 0.1945 2.3179 40.7717 21.5124 0.1465 0.0065 82.3702 18.4466 7.1584 17.2492 72.7238 1.1552 11.6056 31.6564 34.4939 7.4740 8.2670 16.5807 9.0390 5.4054 13.4545 46.4589 22.1998 7.5049
temp: 298.150 k
press: 1.00000 atm
elementType: 8 6 6 6 6 6 6 6 6 6 6 1 1 1 1 1 1 1 1 1 1
symmnumber: 1
zpe: 439323.6 jmol-1
zpe.correction: 0.167330 hartree
zpe.thermalcorrener: 0.176730 hartree
zpe.thermalcorrenthalpy: 0.177675 hartree
zpe.thermalcorrgfe: 0.131494 hartree
zpe.sumelectzpe: -461.470609 hartree
zpe.sumelectthermal: -461.461208 hartree
zpe.sumelectthermalent: -461.460264 hartree
zpe.sumelectthermalfe: -461.506445 hartree
dipole: 1.3582 0.1977 -2.5618
dipole: 2.9063
quadrupole: -51.0992 -60.3441 -68.6243
quadrupole: 0.4842 -6.1500 0.4381
quadrupole: 8.9233 -0.3215 -8.6018 0.4842 -6.1500 0.4381
hfenergy: -461.6379384 hartree
pointgroup: C01 [X(C10H10O1)]
dipole: 0.5280801 -0.0572485 1.0125638 debye
dipolederiv: -0.7091118 0.0039183 -0.0223725 0.0139124 -0.2681843 0.0264201 -0.1194764 0.0278732 -0.7479532 0.3369447 0.0001564 0.0519555 -0.0072442 -0.0349334 0.0028968 0.1213543 0.0015608 -0.0602018 -0.2830204 -0.0048347 0.1757261 -0.0100502 0.1397299 0.0063946 0.4706839 0.0121522 -0.2016266 -0.1340687 0.0757569 0.0352808 0.077129 0.0605977 0.0283289 -0.0193554 0.0025962 -0.1307917 -0.1384142 -0.0766463 0.0345335 -0.073136 0.060106 -0.0190151 -0.0184854 0.0040653 -0.1326126 1.5535401 -0.0056356 -0.1921262 -0.0107591 0.1418934 -0.0316727 -0.2067401 -0.0348523 0.8031061 -0.0223425 -0.0683974 0.0473707 -0.0811082 0.0879788 -0.0197013 0.052293 -0.0234577 -0.1228821 -0.021512 0.065572 0.0493325 0.0765819 0.0854541 0.0295281 0.0557341 0.0323283 -0.1214096 0.0391008 -0.0022444 0.0923234 -0.0008652 -0.0783076 0.0010682 0.085666 0.0015816 -0.1360053 -0.7948242 0.0028711 0.0565738 -0.0073965 -0.1895849 -0.0147759 0.2678125 -0.0158479 0.0918633 0.0599562 -0.0084737 0.0513695 0.0030753 -0.2708306 -0.0190276 -0.1347446 -0.0170897 0.068728 -0.0084858 -0.0273616 -0.0087858 -0.0725923 -0.0191131 -0.1094267 -0.0867814 -0.057308 0.0487723 -0.0102257 0.0281078 -0.0089201 0.0753751 -0.030034 0.1068905 -0.0819073 0.0537073 0.058133 0.0447313 -0.1043369 -0.051688 -0.0930082 -0.0573415 -0.0302614 -0.0464599 -0.0376539 0.119364 0.0443323 0.1072732 -0.0471471 0.0950814 -0.0604525 0.0215661 -0.0427323 0.0301767 0.1226807 0.0310405 0.0867502 -0.0372662 0.1031801 -0.0798831 0.0267437 -0.0462802 0.0250908 0.1418339 0.0310002 -0.084885 -0.0412347 -0.100796 -0.0775304 -0.036963 -0.0505876 -0.0352364 0.139108 -0.1096275 0.0019929 -0.0944436 0.0021228 0.0860286 -0.001074 -0.1009901 -0.0010443 0.1269109 0.0588082 0.0010492 0.0070705 0.0032427 0.1604007 0.0153712 -0.0467555 0.0151684 -0.1201797 -0.0903781 0.005892 -0.0517556 0.0068628 0.1663416 0.0053537 -0.0534714 0.0055603 0.0787619 0.1225565 0.0034755 -0.0457966 0.0003925 0.1776646 0.0113558 0.0012237 0.0106293 -0.0255997 unknown
polarizability: 150.1300837|-0.5325061|90.699559|10.4639696|-0.1567489|75.0779147 unknown
InChI: InChI=1S/C10H10O/c1-2-10(11)8-9-6-4-3-5-7-9/h2-7H,1,8H2
charge 0 multiplicity 1
21 atoms
O  1.595802 0.085333 -1.296036
C  -0.647814 -0.01854 0.532684
C  0.782071 -0.029591 1.034222
C  -1.326177 1.205207 0.307887
C  -1.3240 -1.231953 0.251679
C  1.864005 0.013708 -0.066204
C  -2.650481 1.218242 -0.183432
C  -2.648411 -1.224686 -0.239582
C  -3.31718 0.001875 -0.457769
C  3.276507 -0.032531 0.442663
C  4.345031 -0.003045 -0.396958
H  0.976457 0.834001 1.704263
H  0.983178 -0.930852 1.649518
H  -0.813185 2.153209 0.51294
H  -0.809649 -2.187611 0.413575
H  -3.16047 2.173542 -0.351927
H  -3.156968 -2.172081 -0.451516
H  -4.345092 0.009696 -0.837579
H  3.415496 -0.092072 1.531271
H  5.376015 -0.037065 -0.028638
H  4.183463 0.056215 -1.480462
