program: Gaussian 09
title: 000037733
version: EM64L-G09RevD.01
frameworkgroup: C1[X(C14H14N2O5)]
method: RPBEPBE
basis: SDD
operation: Freq
keyword: #p
keyword: freq=noraman
keyword: PBEPBE/SDD
title: #p freq=noraman PBEPBE/SDD
converged: YES YES NO NO
title: Mulliken charges:
elementType: O O O O O N N C C C C C C C C C C C C C C H H H H H H H H H H H H H H
charge: -0.263683 -0.195320 -0.180904 -0.218738 -0.237926 -0.363804 -0.373775 0.136577 -0.661474 0.173614 0.188308 0.509679 0.174014 -0.361428 -0.406561 0.343141 -0.503863 -0.228946 -0.226239 -0.234891 -0.659798 0.277878 0.233485 0.370145 0.368197 0.245053 0.224588 0.254501 0.251084 0.225573 0.226709 0.229695 0.231994 0.219583 0.233535
chargesum: 0.00000
title: Mulliken charges with hydrogens summed into heavy atoms:
elementType: O O O O O N N C C C C C C C C C C C C C C
charge: -0.263683 -0.195320 -0.180904 -0.218738 -0.237926 0.006341 -0.005579 0.136577 -0.150111 0.173614 0.188308 0.509679 0.174014 -0.116376 -0.181974 0.343141 0.001721 -0.003374 0.000470 -0.005196 0.025313
polarizability: 1.97000735e+02 -1.82439317e+01 1.99976601e+02 2.12957747e+01 1.22773531e+01 1.32722792e+02
1716.lowfreq: -5.0119 -3.4828 0.0005 0.0007 0.0007 6.3095 15.2835 19.8707 35.8514
frequency: 15.1347 19.4863 35.8173 50.7207 54.0032 65.2896 97.8183 113.0583 147.7808 151.2743 160.9304 186.4478 188.2333 214.7728 225.2486 307.5745 313.7179 342.2185 362.1906 364.6152 402.7915 409.4419 475.3027 487.6673 490.3215 544.5306 565.1329 599.4046 616.8363 633.7967 640.1409 650.6983 677.5977 700.2730 705.8779 746.4688 752.2557 770.6441 785.7144 793.4550 819.4223 829.5529 850.6956 891.7269 920.6026 974.7018 985.6690 990.6816 995.2156 997.5244 1010.6075 1027.4148 1028.4502 1031.1240 1079.0219 1087.8891 1090.1196 1126.3721 1173.8647 1190.3049 1193.2147 1218.0501 1241.0462 1244.1931 1300.2949 1324.3950 1334.0009 1342.9205 1356.6772 1378.6208 1380.7535 1386.3252 1401.3145 1439.7218 1443.5821 1457.0766 1472.6344 1481.4216 1484.5465 1595.3930 1615.3395 1633.0892 1647.4731 1667.7778 1677.7453 2998.4028 3002.5390 3002.6623 3045.4311 3064.0028 3100.9039 3105.6014 3112.3270 3127.5053 3140.4491 3152.7759 3166.1886 3520.0028 3522.1727
redmass: 2.3542 3.3694 6.6912 3.9701 4.7531 4.5454 9.8490 5.4450 7.7313 5.8680 6.2562 1.5496 3.1446 4.5682 5.3540 6.1623 7.1084 2.7192 10.5857 6.2202 2.8062 4.2167 7.7710 6.0050 4.4498 2.8022 4.9160 8.2480 6.3119 3.9147 3.7540 3.7643 2.5329 2.8083 2.4035 1.8764 3.5607 2.3998 1.8887 1.3603 4.3732 3.6099 1.2488 2.6620 1.4376 1.3936 3.8858 5.6511 1.3484 5.4703 2.2539 2.4231 2.9149 4.1228 2.8293 1.6172 1.6124 2.9991 1.0542 1.1637 3.1889 2.5740 1.7534 1.1844 2.6743 1.7291 1.2658 1.8183 9.8461 2.0273 1.4183 7.2355 1.2098 1.0882 2.1330 1.1159 1.0387 1.0524 2.2987 6.0734 6.1405 7.6169 9.6703 11.5987 5.0509 1.0589 1.0584 1.0391 1.0986 1.1026 1.1004 1.1006 1.0883 1.0860 1.0915 1.0958 1.1014 1.0759 1.0781
irintensity: 0.0935 0.1252 0.5240 0.2409 1.2892 2.3011 0.9299 0.4527 5.8987 0.7738 4.2152 1.2816 1.7253 0.3700 0.6062 32.2687 4.1123 3.5862 19.3228 9.2300 0.0892 1.1933 10.0205 21.9315 12.0637 1.6116 7.1967 3.7945 0.0822 4.5244 0.7667 4.3105 43.9879 20.1655 57.7804 10.3618 18.7904 10.7087 210.8587 13.2854 1.1551 12.7159 0.8777 13.5576 1.8527 0.4306 3.3774 1.9785 0.1853 29.4298 25.9614 15.8383 20.8765 108.6851 46.0877 0.3711 36.6062 176.7868 0.1390 2.8702 40.1971 8.2898 33.4267 0.8602 216.7376 83.2803 2.0372 42.0368 247.0980 1.3491 0.7449 0.7286 16.7178 31.8667 8.8904 13.8320 13.7872 12.9257 11.9337 1.5479 1.4813 313.1743 175.6250 18.2359 646.2801 20.8883 14.7413 14.1805 1.4521 5.0285 24.8967 24.4998 10.9356 0.1114 19.1124 32.2431 18.4070 86.5738 55.7550
temp: 298.150 k
press: 1.00000 atm
elementType: 8 8 8 8 8 7 7 6 6 6 6 6 6 6 6 6 6 6 6 6 6 1 1 1 1 1 1 1 1 1 1 1 1 1 1
symmnumber: 1
zpe: 692304.2 jmol-1
zpe.correction: 0.263685 hartree
zpe.thermalcorrener: 0.283286 hartree
zpe.thermalcorrenthalpy: 0.284231 hartree
zpe.thermalcorrgfe: 0.212550 hartree
zpe.sumelectzpe: -1026.039850 hartree
zpe.sumelectthermal: -1026.020248 hartree
zpe.sumelectthermalent: -1026.019304 hartree
zpe.sumelectthermalfe: -1026.090985 hartree
dipole: -2.2625 1.2526 0.7598
dipole: 2.6954
quadrupole: -122.2313 -113.1083 -127.9320
quadrupole: 5.5548 2.5369 -1.4272
quadrupole: -1.1408 7.9822 -6.8415 5.5548 2.5369 -1.4272
hfenergy: -1026.3035349 hartree
pointgroup: C01 [X(C14H14N2O5)]
dipole: 0.9225332 -0.4271952 0.3016436 debye
polarizability: 199.7872692|-18.2074893|197.3426006|-20.1433711|-13.8017114|132.5702573 unknown
InChI: InChI=1S/C14H14N2O5/c1-2-10(17)21-14(8-9-6-4-3-5-7-9)11(18)15-13(20)16-12(14)19/h3-7,15-16H,2,8H2,1H3
charge 0 multiplicity 1
35 atoms
O  -0.439672 -1.314355 0.458103
O  -2.21074 0.029139 2.226709
O  0.218282 0.088187 -1.913627
O  -2.646816 3.563226 -0.771664
O  -2.436583 -1.318261 -0.730143
N  -2.351316 1.815279 0.751271
N  -1.085196 1.889248 -1.248659
C  -0.515808 0.154683 0.442345
C  0.7193 0.653715 1.279107
C  -1.78445 0.613947 1.203626
C  -0.438155 0.659468 -1.015797
C  2.080743 0.354741 0.675052
C  -2.063813 2.501272 -0.444874
C  2.65389 -0.938448 0.777767
C  2.812622 1.378463 0.022772
C  -1.505106 -1.965278 -0.204021
C  -1.324004 -3.464863 -0.160436
C  3.929401 -1.201294 0.233455
C  4.089484 1.118358 -0.522306
C  4.651226 -0.174391 -0.418964
C  -2.465986 -4.22438 -0.858288
H  0.606303 0.169536 2.266748
H  0.599902 1.743299 1.427659
H  -3.123376 2.201596 1.30435
H  -0.948411 2.312416 -2.172636
H  2.092605 -1.735804 1.276501
H  2.384688 2.386387 -0.055336
H  -0.344789 -3.694613 -0.623219
H  -1.23221 -3.761494 0.902143
H  4.362032 -2.204452 0.318633
H  4.643894 1.919916 -1.022848
H  5.642042 -0.379329 -0.839562
H  -3.43697 -4.007935 -0.38144
H  -2.285696 -5.312038 -0.80516
H  -2.544014 -3.934842 -1.919858
