program: Gaussian 09
title: 000037731
version: EM64L-G09RevD.01
frameworkgroup: C1[X(C21H23NO5)]
method: RPBEPBE
basis: SDD
operation: Freq
keyword: #p
keyword: freq=noraman
keyword: PBEPBE/SDD
title: #p freq=noraman PBEPBE/SDD
converged: YES YES NO NO
title: Mulliken charges:
elementType: O O O O O N C C C C C C C C C C C C C C C C C C C C C H H H H H H H H H H H H H H H H H H H H H H H
charge: -0.298289 -0.295366 -0.298617 -0.301913 -0.298390 -0.197123 0.253276 0.238301 -0.696369 0.525869 0.567351 -0.540661 0.127318 -0.523075 -0.602808 0.160600 -0.660421 0.214391 -0.506286 -0.470884 0.223522 -0.337183 0.175027 -0.528308 -0.528680 -0.531147 -0.529901 0.246719 0.258933 0.247167 0.261194 0.260672 0.229627 0.259587 0.297606 0.268889 0.234861 0.252561 0.253683 0.221974 0.230462 0.231363 0.257305 0.225467 0.254949 0.221932 0.232679 0.255283 0.225257 0.231595
chargesum: 0.00000
title: Mulliken charges with hydrogens summed into heavy atoms:
elementType: O O O O O N C C C C C C C C C C C C C C C C C C C C C
charge: -0.298289 -0.295366 -0.298617 -0.301913 -0.298390 -0.197123 0.253276 0.238301 -0.190717 0.525869 0.567351 -0.293493 0.127318 -0.261881 -0.342137 0.160600 0.126399 0.214391 -0.237397 -0.236023 0.223522 -0.084622 0.175027 0.177811 0.185455 0.178413 0.182235
polarizability: 3.35258419e+02 -4.17066624e+01 3.00049168e+02 -1.69507024e+01 -3.88889758e+00 1.94243776e+02
1716.lowfreq: -0.0007 -0.0005 -0.0003 2.7030 5.6123 9.8403 13.8295 23.0598 31.3278
frequency: 13.2643 22.6235 31.2803 54.0026 64.6366 69.6813 92.2468 106.2944 111.9540 113.0779 124.1190 146.7219 155.6336 158.4932 162.6899 164.1941 169.5438 183.8735 194.6784 208.9722 220.9483 246.1573 256.6357 265.2609 281.7825 300.5020 327.7947 345.9450 348.8312 375.8623 393.7605 402.8268 410.5746 426.2842 449.1253 468.1548 471.9803 493.9044 499.6679 539.4918 573.5392 579.9609 601.7780 632.3707 672.4511 676.7235 681.9395 701.0172 707.8732 717.6291 734.4708 746.6563 752.1263 777.1499 819.0839 830.5244 840.0826 876.3863 881.7315 900.9516 907.3652 915.6385 940.9233 945.2932 946.8938 957.3453 981.7779 991.6797 1088.0450 1094.4376 1101.4297 1113.5175 1113.8839 1114.4571 1116.1824 1119.3048 1135.5706 1147.7350 1153.1201 1155.9174 1157.0944 1160.9122 1182.6925 1186.7846 1195.1731 1203.3009 1227.0876 1245.1075 1257.0549 1262.6292 1293.2843 1311.3269 1358.1282 1365.9120 1374.8324 1401.8026 1422.5611 1424.5644 1427.8947 1439.4014 1443.3671 1457.6214 1458.0250 1459.1036 1459.7149 1461.2530 1465.9503 1476.7743 1477.5020 1478.3352 1486.2319 1487.6556 1488.2959 1501.4851 1504.7775 1520.7204 1542.3434 1571.1697 1612.1338 1630.0022 1656.8284 2970.9637 2972.9189 2974.7513 2976.3252 2991.8697 3012.5742 3057.5535 3069.2174 3069.4716 3071.0992 3075.8656 3087.3499 3115.5397 3121.7168 3123.7003 3123.8111 3124.1663 3125.8141 3151.7466 3156.2111 3161.7681 3162.1414 3171.6113
redmass: 4.6299 4.9542 5.1363 5.0144 3.6292 3.8630 3.6759 3.4072 2.9443 2.8805 4.3759 2.8892 2.4881 1.7824 1.1011 1.1105 1.1391 2.1810 1.3127 2.4609 3.8098 4.5632 5.3373 5.6080 4.7906 5.7870 4.7035 4.8333 5.6800 3.7654 4.1766 4.6035 3.7867 3.6447 4.3351 4.3980 4.3560 5.3072 4.1077 5.4465 4.0977 5.4322 4.6009 5.8764 4.6269 4.9298 6.1077 5.4152 6.0834 4.9754 3.5216 3.7960 4.2440 4.6630 2.4977 1.6888 1.4874 3.2277 1.7377 1.7306 1.8619 3.8830 2.4937 5.5373 5.2905 1.5618 4.1089 2.9204 3.8111 3.0849 3.4087 1.2441 1.2586 1.2471 1.2455 1.3292 1.5987 1.4686 1.3330 1.4636 1.5093 2.2579 1.3865 2.5779 1.8571 1.6535 1.7295 2.9337 1.5138 1.7735 2.1252 3.6752 3.0035 4.8440 2.2923 2.1317 1.2962 1.1787 1.3535 1.3591 1.3827 1.0547 1.3368 1.1056 1.0736 1.1426 2.1324 1.0870 1.0656 1.4997 1.0653 1.7692 1.0790 2.3130 1.3366 4.7818 6.7576 7.3539 6.5163 7.5880 8.2592 1.0312 1.0310 1.0311 1.0310 1.0346 1.0605 1.0988 1.1034 1.1036 1.1040 1.1036 1.0988 1.1020 1.1028 1.1028 1.1014 1.0907 1.1032 1.0915 1.0918 1.0922 1.0937 1.0915
irintensity: 0.2164 0.1402 0.4364 0.4708 4.4545 2.9943 1.4187 2.6001 10.2264 4.8707 9.4430 1.5082 0.4392 3.9516 0.1299 0.0587 0.3600 2.3579 0.7006 2.1617 9.9536 8.9097 2.3798 11.0059 4.1273 1.8656 2.2628 2.2090 2.7217 0.8497 6.3651 10.7375 3.6869 5.9205 1.7731 5.4809 7.6314 7.3840 6.2144 8.5902 7.8034 19.1711 4.9775 4.3814 14.8889 6.8826 1.4204 2.6774 10.9388 8.2699 13.3773 11.7047 5.6083 8.5992 1.2363 34.5699 8.2692 11.4189 7.7850 30.8815 20.1747 46.0301 34.0935 48.3533 107.8073 4.4840 52.8746 28.3709 19.8541 47.1710 67.8756 19.1889 20.3702 3.8681 3.1748 0.8545 7.6411 20.2401 0.6267 6.0367 11.8595 16.5204 56.7806 37.4803 39.5234 56.1756 52.5085 126.2866 12.3135 66.8988 24.0533 42.3217 35.6281 24.3292 64.6015 18.1751 24.1712 2.5335 34.0106 19.7787 16.2717 11.5494 91.0074 23.9188 13.9621 44.0922 23.5778 21.9256 6.9424 97.1888 39.1643 38.5721 37.7728 21.6728 20.2228 193.0023 27.0869 10.4506 8.0202 49.7660 570.7124 63.4791 84.6370 63.7086 84.5081 35.6544 18.3773 5.3502 51.8612 7.4037 20.7091 21.8941 10.9069 3.5424 25.6789 17.0115 33.5086 4.4656 23.7444 2.3221 4.2355 5.6803 7.1729 2.1353
temp: 298.150 k
press: 1.00000 atm
elementType: 8 8 8 8 8 7 6 6 6 6 6 6 6 6 6 6 6 6 6 6 6 6 6 6 6 6 6 1 1 1 1 1 1 1 1 1 1 1 1 1 1 1 1 1 1 1 1 1 1 1
symmnumber: 1
zpe: 1040891.4 jmol-1
zpe.correction: 0.396455 hartree
zpe.thermalcorrener: 0.423416 hartree
zpe.thermalcorrenthalpy: 0.424360 hartree
zpe.thermalcorrgfe: 0.338132 hartree
zpe.sumelectzpe: -1242.861085 hartree
zpe.sumelectthermal: -1242.834123 hartree
zpe.sumelectthermalent: -1242.833179 hartree
zpe.sumelectthermalfe: -1242.919407 hartree
dipole: -1.4362 -4.8998 2.7938
dipole: 5.8203
quadrupole: -137.0818 -166.5185 -160.5687
quadrupole: -10.6843 6.9580 17.4081
quadrupole: 17.6412 -11.7955 -5.8457 -10.6843 6.9580 17.4081
hfenergy: -1243.2575391 hartree
pointgroup: C01 [X(C21H23N1O5)]
dipole: -0.6560093 -1.8819971 1.1275189 debye
polarizability: 333.3301929|-42.9627257|302.5075211|-12.3596473|-7.0794519|193.7136486 unknown
InChI: InChI=1S/C21H23NO5/c1-22-16(8-13-6-7-17(24-2)18(9-13)25-3)15-12-20(27-5)19(26-4)10-14(15)11-21(22)23/h6-7,9-12H,8H2,1-5H3
charge 0 multiplicity 1
50 atoms
O  3.041332 -2.627814 1.259261
O  4.991458 -1.617137 -0.648204
O  0.909556 4.391275 -1.495828
O  -2.971479 -1.921967 -1.421654
O  -5.552412 -1.109435 -0.282766
N  0.248397 2.721183 0.056744
C  0.430852 1.515708 0.701984
C  1.546933 0.697911 0.377569
C  -0.595709 1.108937 1.748716
C  2.498026 1.178091 -0.624056
C  -1.896389 0.522377 1.181623
C  1.765648 -0.598139 0.970618
C  1.167172 3.258931 -0.968382
C  2.287091 2.414439 -1.255851
C  3.653221 0.366644 -0.922593
C  2.871381 -1.366364 0.640182
C  -0.911473 3.591517 0.364025
C  3.857329 -0.855164 -0.301078
C  -1.873711 -0.422221 0.126836
C  -3.14542 0.881535 1.748415
C  -3.067865 -0.992008 -0.361106
C  -4.346558 0.334572 1.248442
C  -4.323487 -0.586462 0.180127
C  2.94618 -3.780391 0.330335
C  5.929462 -1.896474 0.466953
C  -3.484972 -3.277058 -1.109402
C  -5.865907 -0.794839 -1.698025
H  -0.847275 1.979533 2.381313
H  -0.130767 0.375223 2.429319
H  1.054259 -1.030853 1.67976
H  2.989222 2.788711 -2.005507
H  4.397184 0.723508 -1.642071
H  -0.821207 4.026432 1.375929
H  -1.853425 3.02641 0.285055
H  -0.887818 4.407597 -0.375012
H  -0.931572 -0.736562 -0.334577
H  -3.181656 1.601067 2.575277
H  -5.31923 0.620848 1.661173
H  3.695446 -3.697333 -0.477491
H  1.929273 -3.834577 -0.103145
H  3.139925 -4.67127 0.94696
H  6.705963 -2.546589 0.036675
H  5.412724 -2.403717 1.300657
H  6.382508 -0.951009 0.820113
H  -4.543678 -3.239776 -0.795855
H  -2.874715 -3.737151 -0.309188
H  -3.376151 -3.851257 -2.041801
H  -5.071074 -1.161514 -2.372076
H  -5.988408 0.29745 -1.823887
H  -6.817986 -1.305818 -1.906307
