program: Gaussian 09
title: 000037727
version: EM64L-G09RevD.01
frameworkgroup: C1[X(C20H24N2O)]
method: RPBEPBE
basis: SDD
operation: Freq
keyword: #p
keyword: freq=noraman
keyword: PBEPBE/SDD
title: #p freq=noraman PBEPBE/SDD
converged: YES YES NO NO
title: Mulliken charges:
elementType: O N N C C C C C C C C C C C C C C C C C C C C H H H H H H H H H H H H H H H H H H H H H H H H
charge: -0.241349 -0.186211 -0.098688 -0.081126 0.268157 0.084444 0.227092 0.427227 -0.390165 -0.715657 -0.431771 -0.415189 -0.356851 -0.346643 -0.400736 -0.359530 -0.265132 -0.223167 -0.244863 -0.257900 -0.242637 -0.604879 -0.638222 0.206220 0.282635 0.227755 0.240620 0.229685 0.245515 0.218248 0.256304 0.241801 0.203976 0.193244 0.256512 0.259638 0.227916 0.225292 0.223500 0.224494 0.227140 0.220123 0.186817 0.223111 0.185665 0.269228 0.218355
chargesum: 0.00000
title: Mulliken charges with hydrogens summed into heavy atoms:
elementType: O N N C C C C C C C C C C C C C C C C C C C C
charge: -0.241349 -0.186211 -0.098688 -0.081126 0.268157 0.084444 0.227092 0.427227 0.098689 -0.017596 0.031992 -0.158885 -0.115049 0.050576 -0.144224 -0.099892 -0.037216 0.002125 -0.021363 -0.033406 -0.015497 0.025172 0.035026
polarizability: 2.44281291e+02 1.72808908e+00 2.65247632e+02 1.67082221e+01 -1.91563342e+01 1.73623552e+02
1716.lowfreq: -9.3963 -4.1533 -0.0003 0.0004 0.0005 4.1398 14.0786 23.1450 29.0660
frequency: 13.4762 23.0039 28.9986 42.5196 59.8892 75.3542 91.8451 103.9349 114.5529 172.0025 195.3646 204.8804 207.0235 227.6068 234.9349 246.5701 256.9056 279.8479 293.2514 298.0158 307.6507 337.6894 352.3389 376.9002 405.3574 413.2105 433.9112 475.0186 480.4346 503.3027 509.0178 570.8605 606.4779 616.3870 636.2769 652.6695 688.1531 702.1003 710.4921 736.0515 747.6864 760.3471 768.4149 782.0459 810.7537 850.6095 856.9375 861.3966 875.6517 899.8090 924.0255 940.6150 964.0093 975.0732 980.8299 990.5124 995.8033 1014.7436 1020.2863 1026.5739 1037.6217 1047.3088 1056.5714 1063.3643 1077.4316 1083.7714 1088.1176 1097.9773 1108.6958 1118.5968 1139.5229 1156.7794 1170.1435 1173.0750 1180.4720 1198.2325 1214.3622 1239.0666 1255.1991 1264.9972 1270.9324 1291.7094 1316.5093 1323.7096 1328.2948 1341.6537 1365.5707 1370.3749 1375.2129 1382.1739 1406.4033 1420.5814 1432.8729 1444.4310 1453.3671 1458.9918 1461.4848 1463.0672 1470.9845 1472.2486 1473.8835 1477.1536 1480.4504 1483.7337 1486.0067 1494.5083 1587.8850 1598.0019 1608.8436 1618.6534 1641.7452 2827.5892 2847.3920 2864.0072 2990.5390 2996.8006 3000.1539 3013.5953 3016.1832 3032.0603 3054.4443 3075.5773 3085.3239 3087.0507 3090.4875 3102.3986 3122.0646 3127.4224 3132.8997 3135.8556 3149.6145 3150.9444 3159.4426 3166.0449 3167.6811
redmass: 3.4816 4.7174 3.4492 3.9897 3.5629 3.6855 3.8835 4.0950 5.3285 3.7960 2.4097 1.6285 1.8510 1.1677 1.5517 3.2458 2.1381 2.3231 3.1186 2.9092 3.0009 3.2865 2.5736 3.9138 2.8594 2.5341 3.4186 4.6420 4.9718 3.7983 3.6894 3.7808 5.0187 6.3036 4.5776 4.4108 5.7622 3.1062 2.2736 1.7538 2.0555 1.9510 2.2824 2.5384 2.2556 1.6250 1.9107 1.3738 1.9527 2.6703 1.4320 1.3837 2.2250 1.3265 1.3872 4.3328 1.4044 4.0526 2.8112 2.4351 1.5401 2.3262 2.2912 1.9301 1.8752 1.8187 1.7355 1.7186 1.6842 2.7297 1.4972 1.6636 1.2920 1.0601 2.0851 1.1217 2.1545 1.6862 2.7627 1.9323 1.9987 1.3590 1.3939 1.3977 1.8231 2.6926 1.4209 1.3926 3.6339 1.4161 4.2902 1.1432 2.2402 1.1632 2.2737 1.0800 1.0576 1.1403 1.0904 1.1070 1.0647 1.0856 2.4930 1.0645 2.4708 1.0625 5.9978 7.4056 6.0842 7.5554 9.7077 1.0701 1.0571 1.0568 1.0340 1.0814 1.0670 1.0633 1.0718 1.0737 1.0980 1.1010 1.1014 1.1023 1.1010 1.1005 1.0846 1.0857 1.0889 1.0898 1.0932 1.0941 1.0944 1.1001 1.0998
irintensity: 0.6694 0.3990 0.6120 0.3974 0.8931 1.3832 0.3414 0.1063 1.7894 1.0672 0.4947 0.5378 0.4860 0.1353 1.6928 0.7996 1.0618 1.8157 1.1569 5.2280 8.0190 12.9589 1.7015 1.5687 0.1960 0.1229 1.9523 5.4182 5.1843 21.0971 5.1127 9.2469 9.7803 0.2849 5.3418 3.8868 3.4987 16.6553 44.0791 12.4177 21.0074 58.3292 31.0413 11.7420 5.9194 3.1504 0.5263 0.2758 2.4144 10.0741 2.2680 1.9662 21.9361 0.1901 0.3547 0.2918 0.1207 0.5217 11.9185 39.6288 20.1887 12.4307 5.5511 1.8878 13.8110 9.9756 19.7889 12.7446 6.4784 1.6966 7.8637 30.7596 3.3256 0.9728 4.7887 4.4155 60.0085 16.7217 8.8129 5.3371 3.2394 1.1846 11.2442 3.5160 80.0457 53.5561 6.0996 3.2445 5.8232 15.3929 3.7483 2.5977 8.8304 7.3457 37.5281 6.2456 10.9297 2.7727 7.0323 26.7544 12.5455 19.2147 72.3721 6.5422 88.4395 12.6893 0.4112 66.9500 16.6745 152.5930 112.0310 67.8830 94.6019 241.6622 22.6652 24.7027 22.8077 20.6214 51.3705 23.1695 22.0173 30.1625 28.3872 11.1970 27.4830 15.3042 0.2659 1.9587 10.3898 15.5911 31.6282 21.6057 16.6749 27.4753 11.5061
temp: 298.150 k
press: 1.00000 atm
elementType: 8 7 7 6 6 6 6 6 6 6 6 6 6 6 6 6 6 6 6 6 6 6 6 1 1 1 1 1 1 1 1 1 1 1 1 1 1 1 1 1 1 1 1 1 1 1 1
symmnumber: 1
zpe: 1032967.7 jmol-1
zpe.correction: 0.393437 hartree
zpe.thermalcorrener: 0.415411 hartree
zpe.thermalcorrenthalpy: 0.416356 hartree
zpe.thermalcorrgfe: 0.340354 hartree
zpe.sumelectzpe: -959.576123 hartree
zpe.sumelectthermal: -959.554148 hartree
zpe.sumelectthermalent: -959.553204 hartree
zpe.sumelectthermalfe: -959.629206 hartree
dipole: 0.5251 1.9835 -1.6626
dipole: 2.6409
quadrupole: -124.1512 -129.1750 -137.8939
quadrupole: 1.2654 -2.5560 -0.6949
quadrupole: 6.2555 1.2317 -7.4872 1.2654 -2.5560 -0.6949
hfenergy: -959.9695591 hartree
pointgroup: C01 [X(C20H24N2O1)]
dipole: 0.3205696 -0.6948182 0.7028463 debye
polarizability: 242.7321484|-6.7083329|260.204811|-18.4852415|-28.2536912|180.2155156 unknown
InChI: InChI=1S/C20H24N2O/c1-20(16-10-5-4-6-11-16)17-12-7-8-13-18(17)22(19(20)23)15-9-14-21(2)3/h4-8,10-13H,9,14-15H2,1-3H3
charge 0 multiplicity 1
47 atoms
O  0.502705 1.255262 -1.514395
N  0.873353 -0.774179 -0.367809
N  4.767134 1.071981 -0.321874
C  -1.428148 -0.235116 -0.814874
C  -1.287053 -1.584576 -0.116349
C  0.068158 0.209983 -0.957711
C  0.088369 -1.844794 0.134509
C  -2.199624 0.840851 -0.013067
C  2.338009 -0.657165 -0.302824
C  -2.033807 -0.399065 -2.242846
C  2.81213 0.105989 0.955365
C  -2.250294 -2.540461 0.237985
C  0.520992 -3.029666 0.759628
C  4.329038 0.388556 0.91927
C  -2.790995 0.572514 1.24693
C  -2.311785 2.152461 -0.549044
C  -1.83564 -3.747057 0.862737
C  -0.465283 -3.980404 1.124305
C  -3.49642 1.581419 1.943542
C  -3.014114 3.158748 0.146906
C  -3.616781 2.87725 1.395396
C  6.239476 1.132417 -0.416432
C  4.143008 2.399118 -0.517792
H  2.782612 -1.668633 -0.343713
H  2.678282 -0.107837 -1.1968
H  -3.095493 -0.693243 -2.17166
H  -1.966081 0.55006 -2.800055
H  -1.489759 -1.174944 -2.809991
H  2.246419 1.052762 1.026551
H  2.581335 -0.472496 1.87082
H  -3.312119 -2.361815 0.034193
H  1.580323 -3.22212 0.957191
H  4.88232 -0.570214 0.980064
H  4.602137 0.978225 1.834734
H  -2.697778 -0.42185 1.693815
H  -1.817932 2.392203 -1.495978
H  -2.579965 -4.498974 1.145132
H  -0.157034 -4.912057 1.611993
H  -3.948063 1.352066 2.915634
H  -3.085652 4.164412 -0.28279
H  -4.164757 3.658151 1.934724
H  6.660908 0.112307 -0.35802
H  6.71257 1.747383 0.392168
H  6.531709 1.568289 -1.388478
H  4.352719 3.108623 0.32308
H  3.049774 2.303833 -0.63243
H  4.532998 2.846902 -1.448938
