program: Gaussian 09
title: 000037725
version: EM64L-G09RevD.01
frameworkgroup: C1[X(C16H13ClN2O)]
method: RPBEPBE
basis: SDD
operation: Freq
keyword: #p
keyword: freq=noraman
keyword: PBEPBE/SDD
title: #p freq=noraman PBEPBE/SDD
converged: YES YES NO NO
title: Mulliken charges:
elementType: Cl O N N C C C C C C C C C C C C C C C C H H H H H H H H H H H H H
charge: -0.051568 -0.249612 -0.178352 -0.042693 0.338515 0.243950 -0.719605 -0.054987 0.240390 0.323152 -0.408437 -0.328019 -0.222975 -0.128695 -0.378463 -0.382183 -0.599179 -0.233524 -0.228078 -0.239155 0.262708 0.263436 0.250516 0.294796 0.260927 0.257090 0.266830 0.267249 0.244373 0.237594 0.231200 0.229993 0.232803
chargesum: 0.00000
title: Mulliken charges with hydrogens summed into heavy atoms:
elementType: Cl O N N C C C C C C C C C C C C C C C C
charge: -0.051568 -0.249612 -0.178352 -0.042693 0.338515 0.243950 -0.193461 -0.054987 0.240390 0.323152 -0.157920 -0.033223 0.037951 -0.128695 -0.121372 -0.115353 0.150037 -0.002324 0.001915 -0.006352
polarizability: 2.67449721e+02 1.76595957e+01 2.39059512e+02 -1.46208408e+01 1.28158086e+01 1.25272354e+02
1716.lowfreq: -8.9150 -5.1003 -0.0027 -0.0025 -0.0007 1.4858 39.5810 56.1744 67.5369
frequency: 39.5438 56.1665 67.5348 75.2407 85.6179 106.3621 122.4201 173.5638 178.0132 221.0620 247.0937 292.1756 304.5799 307.8881 331.6774 371.0914 386.0234 396.5140 405.9824 436.4101 451.7686 490.2481 514.9095 568.0312 581.3768 602.7782 615.9299 649.4185 663.4469 692.8061 700.1904 721.3526 752.1278 782.2163 792.5584 815.8976 838.9172 857.5004 900.7123 932.0513 936.5893 946.1558 961.4273 974.4220 986.3257 989.3031 1001.4450 1026.9979 1067.7320 1083.0198 1084.5674 1123.8377 1130.6496 1146.9429 1173.7211 1175.0049 1188.5432 1196.9490 1222.3430 1263.4818 1281.3272 1308.4717 1312.9100 1319.0301 1373.9615 1380.5897 1388.7964 1410.5484 1432.7557 1458.2594 1469.8640 1472.7338 1482.0934 1482.4792 1499.5286 1569.8103 1585.4284 1598.0650 1602.3588 1608.5985 2992.7265 3002.5944 3094.1271 3110.3820 3127.8761 3135.0479 3136.7586 3143.7356 3149.1975 3161.4932 3169.9793 3171.9804 3175.4140
redmass: 5.3604 4.2938 7.8875 5.3211 4.5976 1.0912 4.7305 5.6928 5.7106 4.8595 5.6006 5.6969 4.8155 4.0180 6.8382 4.8946 5.5164 4.8117 2.9397 2.9316 4.3573 3.8195 4.6136 5.0677 6.1968 5.5585 6.4036 5.1055 6.3253 6.8447 1.8420 4.8735 3.0918 2.8365 3.2681 2.2876 2.3987 1.2498 1.4568 2.5896 1.4558 2.7682 1.4804 3.1078 1.3983 6.2454 1.3263 2.2065 2.4732 2.1722 1.5962 1.4630 1.7359 2.4054 1.0564 1.4089 1.1596 2.3648 2.7627 1.3303 2.1720 3.4214 1.7698 1.7067 5.3229 7.0101 4.9510 1.2172 2.3010 1.1160 1.9958 1.2356 1.1011 2.2371 6.7662 7.6258 6.2847 6.9568 9.0084 6.1199 1.0668 1.0331 1.1027 1.0960 1.0849 1.1007 1.0884 1.0898 1.0934 1.0966 1.0926 1.0993 1.0963
irintensity: 0.1782 0.1385 0.3591 0.7023 4.2713 0.1170 1.6748 0.4401 8.5877 2.5532 1.3104 3.6314 2.2080 8.5329 3.0015 7.3098 9.0687 2.5229 0.4404 2.0873 10.7567 7.4131 9.8626 1.3317 15.3013 23.5511 0.0948 12.2029 1.8591 7.4253 50.8111 11.3593 13.2688 14.7519 43.8676 31.4668 39.6110 2.9287 16.7489 2.0893 1.6610 42.2997 4.0549 12.7391 1.1887 0.7099 0.3423 9.7562 36.3048 16.8225 13.4720 14.4263 27.0715 17.5836 0.1544 1.5041 6.4331 36.5143 17.9688 5.7874 87.2099 43.9885 38.3765 21.2279 1.6761 0.6359 10.8518 37.7830 19.9255 24.0897 87.3489 3.0676 28.5516 6.9927 8.4685 8.6974 0.1170 13.6738 401.7319 0.8957 9.8381 43.2345 20.9644 4.8356 1.3579 0.2322 5.1044 5.2081 26.6643 21.0814 0.1216 16.7750 3.0419
temp: 298.150 k
press: 1.00000 atm
elementType: 17 8 7 7 6 6 6 6 6 6 6 6 6 6 6 6 6 6 6 6 1 1 1 1 1 1 1 1 1 1 1 1 1
symmnumber: 1
zpe: 656855.0 jmol-1
zpe.correction: 0.250183 hartree
zpe.thermalcorrener: 0.267089 hartree
zpe.thermalcorrenthalpy: 0.268033 hartree
zpe.thermalcorrgfe: 0.204825 hartree
zpe.sumelectzpe: -1260.884323 hartree
zpe.sumelectthermal: -1260.867417 hartree
zpe.sumelectthermalent: -1260.866473 hartree
zpe.sumelectthermalfe: -1260.929680 hartree
dipole: 2.3727 0.5317 0.9320
dipole: 2.6041
quadrupole: -119.4217 -129.1523 -118.6937
quadrupole: -9.1369 -4.2373 8.2000
quadrupole: 3.0009 -6.7297 3.7288 -9.1369 -4.2373 8.2000
hfenergy: -1261.1345058 hartree
pointgroup: C01 [X(C16H13Cl1N2O1)]
dipole: -0.9495388 -0.1328983 0.3610297 debye
polarizability: 270.7531729|13.6871208|236.9939032|13.8472238|-8.2340801|124.0345107 unknown
InChI: InChI=1S/C16H13ClN2O/c1-19-15(20)9-12-7-8-13(17)10-14(12)16(18-19)11-5-3-2-4-6-11/h2-8,10H,9H2,1H3
charge 0 multiplicity 1
33 atoms
Cl 0.521101 -4.479747 -1.328578
O  3.623468 2.322481 0.159554
N  1.381897 2.187706 -0.490659
N  0.033019 1.834028 -0.304289
C  1.769417 -0.527435 0.750191
C  0.517439 -0.608275 0.074249
C  2.158037 0.780364 1.403566
C  -0.364005 0.58662 -0.042197
C  2.477885 1.813178 0.31804
C  -1.848253 0.426018 0.067103
C  2.625337 -1.653922 0.773882
C  0.136018 -1.828607 -0.553034
C  2.256145 -2.862598 0.147759
C  1.008947 -2.925028 -0.508051
C  -2.41344 -0.615004 0.854347
C  -2.721685 1.335864 -0.591026
C  1.527396 3.341216 -1.404937
C  -3.814236 -0.746784 0.973116
C  -4.118795 1.199392 -0.474942
C  -4.673078 0.156622 0.307219
H  1.333082 1.162746 2.036177
H  3.060021 0.675748 2.024264
H  3.590157 -1.587017 1.287977
H  -0.818871 -1.901257 -1.080399
H  2.916694 -3.733865 0.170496
H  -1.758556 -1.312297 1.387551
H  -2.283222 2.143594 -1.184237
H  2.57752 3.666769 -1.376002
H  0.861133 4.157075 -1.07654
H  1.254803 3.042829 -2.430969
H  -4.233251 -1.550715 1.588171
H  -4.778663 1.902485 -0.995259
H  -5.760062 0.051519 0.395956
