program: Gaussian 09
title: 000037722
version: EM64L-G09RevD.01
frameworkgroup: C1[X(C8H10FNO2)]
method: RPBEPBE
basis: SDD
operation: Freq
keyword: #p
keyword: freq=noraman
keyword: PBEPBE/SDD
title: #p freq=noraman PBEPBE/SDD
converged: NO YES NO NO
title: Mulliken charges:
elementType: F O O N C C C C C C C C H H H H H H H H H H
charge: -0.192287 -0.478773 -0.407810 -0.635562 -0.164668 0.492701 -0.452477 -0.522510 -0.421902 0.249572 -0.335285 0.115910 0.202397 0.245148 0.217692 0.309906 0.231355 0.221060 0.371338 0.305865 0.290661 0.357669
chargesum: 0.00000
title: Mulliken charges with hydrogens summed into heavy atoms:
elementType: F O O N C C C C C C C C
charge: -0.192287 -0.107434 -0.050142 -0.039036 0.037729 0.492701 0.010362 -0.212603 -0.190547 0.249572 -0.114225 0.115910
polarizability: 1.42604301e+02 -3.39964828e+00 1.01241064e+02 4.41483830e+00 3.73421903e+00 5.81331980e+01
1716.lowfreq: -6.3820 -0.0011 0.0001 0.0006 10.0116 11.4649 33.5359 74.3943 105.8249
frequency: 33.4869 74.3891 105.8218 163.7031 188.7603 241.1877 277.5596 282.6954 323.4936 327.9329 334.8958 383.2480 444.9779 454.9025 525.3729 555.6907 574.0387 619.5196 699.0340 713.1882 733.2157 773.5974 779.1208 790.6524 868.0568 894.4993 923.1585 932.1972 953.6494 1040.4979 1061.5557 1073.3595 1126.8919 1134.8618 1158.1419 1223.6713 1253.4596 1268.6064 1270.6671 1277.8119 1309.7242 1348.6973 1400.4507 1400.9838 1428.7921 1459.1543 1507.4075 1598.6934 1634.0174 1640.5781 2903.9607 2963.6341 3064.4788 3113.1861 3138.5946 3181.6971 3233.5223 3463.9351 3581.9588 3588.2313
redmass: 4.7383 4.4060 2.7285 5.5752 5.0240 5.3648 8.0811 1.2689 2.4560 2.6298 1.6886 5.6802 3.6048 3.5060 6.0891 3.2545 5.5152 4.4800 1.2658 3.9205 4.8248 2.9744 1.2359 1.5297 2.9001 1.4334 1.3424 1.5683 3.2470 3.8840 3.1139 2.6999 1.4538 1.6101 1.2125 2.2333 1.3207 2.8238 1.3333 1.2230 1.2119 1.2681 2.9051 2.2482 3.7300 1.0887 3.3266 7.0066 7.2798 1.0927 1.0831 1.0660 1.0980 1.0873 1.0963 1.0920 1.0631 1.0462 1.0662 1.0975
irintensity: 3.4968 1.8499 2.4428 1.1162 1.5173 5.0597 4.7331 7.6670 7.1563 40.5781 111.9232 6.4083 4.4938 2.8721 6.1590 27.4721 7.1142 13.7169 126.2036 3.3612 26.0192 52.0053 154.7243 49.2842 11.9424 27.2989 8.0500 2.8502 43.6790 28.9487 125.2343 46.3399 76.8804 8.3580 28.6367 64.5671 32.6163 54.6526 47.9006 18.1746 33.9612 5.4905 46.9653 39.9574 44.4379 10.8165 105.6770 15.9876 10.0238 38.6209 59.8196 50.4439 22.3803 16.8731 14.7142 5.3203 162.1255 0.9385 46.0945 7.6834
temp: 298.150 k
press: 1.00000 atm
elementType: 9 8 8 7 6 6 6 6 6 6 6 6 1 1 1 1 1 1 1 1 1 1
symmnumber: 1
zpe: 447542.5 jmol-1
zpe.correction: 0.170460 hartree
zpe.thermalcorrener: 0.182095 hartree
zpe.thermalcorrenthalpy: 0.183039 hartree
zpe.thermalcorrgfe: 0.132505 hartree
zpe.sumelectzpe: -614.964274 hartree
zpe.sumelectthermal: -614.952639 hartree
zpe.sumelectthermalent: -614.951695 hartree
zpe.sumelectthermalfe: -615.002229 hartree
dipole: -3.7601 -5.4775 1.7003
dipole: 6.8580
quadrupole: -54.7003 -67.2435 -72.3153
quadrupole: -6.8909 -7.2969 2.7216
quadrupole: 10.0527 -2.4905 -7.5623 -6.8909 -7.2969 2.7216
hfenergy: -615.1347342 hartree
pointgroup: C01 [X(C8H10F1N1O2)]
dipole: 1.4498064 -1.406879 -1.7885191 debye
dipolederiv: -0.480848 0.3334498 0.1440306 0.4292773 -0.6770973 -0.2472213 0.1750566 -0.2466595 -0.2447993 -0.6806805 -0.0811143 -0.0495328 -0.1718039 -0.5566024 -0.0160936 -0.1690865 -0.0939788 -0.6991339 -1.5095534 -0.0616194 -0.1324317 -0.054488 -0.1034558 0.1395237 -0.1706327 0.1382094 -0.3458463 -0.8025358 -0.1657107 0.02456 -0.1955178 -0.2866938 -0.1342541 0.0724656 -0.1559637 -0.631713 0.3399036 0.0437775 0.1010341 0.0820016 0.4816218 0.0152206 0.3554542 0.0795228 0.3550741 0.2265081 -0.0087317 -0.039394 0.0662523 -0.0781475 0.0007773 0.0354403 0.0070221 -0.1044729 0.5521892 0.1345176 0.0521028 0.0949053 0.1989546 0.0728077 -0.2437989 0.0350804 0.1267777 -0.1634632 0.0341971 0.0473782 -0.0167275 -0.0742121 0.0246057 0.037266 0.057005 -0.0898823 -0.0544259 0.0534305 0.0620841 -0.095588 0.017354 0.0798903 -0.0335954 0.0933739 -0.1181425 0.3449751 -0.3231146 -0.1375083 -0.6466212 0.7525484 0.2985313 -0.3040901 0.3216089 0.2098863 -0.2105923 -0.0708471 -0.0307979 0.1850205 -0.0012727 0.1065435 0.0872026 0.0789086 -0.1328967 1.3598852 0.0302024 0.1572472 0.1507865 -0.0817428 -0.0427359 0.2428498 -0.0588251 0.0358511 -0.0660148 0.0564856 -0.0373599 0.066439 -0.2176596 0.0178398 -0.0195752 0.0122264 -0.0069848 0.0218001 0.0511405 -0.0379291 0.0530552 -0.0580542 0.089439 -0.0544707 0.0303014 0.0531915 -0.0122348 -0.04904 -0.0277773 -0.0676177 -0.0695884 -0.1601297 -0.0277124 -0.1111148 -0.0698172 0.1747273 -0.0242797 -0.0247166 -0.0201717 0.0710691 -0.0448526 -0.00565 -0.0529652 0.1448808 0.0200236 0.1058705 0.0258033 0.097733 -0.0071 -0.0680958 0.0271138 -0.0639882 0.1192325 -0.0144031 -0.0878031 -0.0628729 -0.077454 0.000765 -0.0926897 -0.0670228 -0.0956786 0.1170795 0.3346634 -0.0195176 -0.0816955 0.0222951 0.2811631 -0.0212001 -0.0709569 0.0064666 0.4612175 0.0920586 -0.0224347 0.0312612 0.0080047 0.2053454 0.0871905 0.0918805 0.1420758 0.1865787 0.1132485 0.0313551 -0.0016179 0.0892427 0.083223 0.0293619 0.033736 0.0053802 0.3112201 0.4147689 0.0397861 0.0181325 0.0009764 0.119582 -0.1344584 0.0081262 -0.1280076 0.3226991 unknown
polarizability: 142.8254617|2.3145239|91.9065507|2.4021372|18.2334063|67.2465498 unknown
InChI: InChI=1S/C8H10FNO2/c9-6-3-5(8(12)4-10)1-2-7(6)11/h1-3,8,11-12H,4,10H2
charge 0 multiplicity 1
22 atoms
F  -2.430784 1.821247 1.001533
O  2.407448 0.656137 1.423261
O  -3.723587 -0.253861 -0.243314
N  4.119748 0.457577 -0.604308
C  2.010536 -0.315642 0.414894
C  0.498341 -0.338399 0.265517
C  2.718169 0.086661 -0.922878
C  -0.27935 0.751323 0.725751
C  -0.149268 -1.426081 -0.367002
C  -1.665492 0.738481 0.535371
C  -1.54935 -1.424534 -0.554589
C  -2.331135 -0.334556 -0.104832
H  2.363276 -1.332435 0.706745
H  2.211617 0.981206 -1.326505
H  2.620567 -0.727951 -1.670285
H  0.205885 1.580465 1.24706
H  0.434029 -2.289884 -0.707282
H  -2.03989 -2.276009 -1.043795
H  3.332692 0.926236 1.119476
H  4.513034 1.200501 -1.188671
H  4.761566 -0.337947 -0.518316
H  -4.073051 -1.065137 -0.689131
