program: Gaussian 09
title: 000037714
version: EM64L-G09RevD.01
frameworkgroup: C1[X(C4H8O3)]
method: RPBEPBE
basis: SDD
operation: Freq
keyword: #p
keyword: freq=noraman
keyword: PBEPBE/SDD
title: #p freq=noraman PBEPBE/SDD
converged: YES YES NO NO
title: Mulliken charges:
elementType: O O O C C C C H H H H H H H H
charge: -0.227814 -0.393717 -0.276740 -0.378050 -0.249106 -0.676623 0.265883 0.221509 0.221508 0.227197 0.227200 0.213203 0.229635 0.213186 0.382731
chargesum: 0.00000
title: Mulliken charges with hydrogens summed into heavy atoms:
elementType: O O O C C C C
charge: -0.227814 -0.010986 -0.276740 0.064966 0.205291 -0.020600 0.265883
polarizability: 7.27380014e+01 2.12382130e-01 5.15083415e+01 6.97823964e-03 -4.00050921e-04 3.84856085e+01
1716.lowfreq: -5.3366 -1.5181 0.0008 0.0009 0.0011 15.8693 48.4988 77.2655 127.2448
frequency: 47.7157 77.1932 127.2441 174.6883 216.3990 300.5899 329.8377 519.0931 520.1811 604.1013 700.0078 760.5842 856.0255 880.7562 902.7128 998.1327 1050.5093 1091.9212 1138.8213 1144.7489 1229.9165 1282.4100 1303.9494 1330.7481 1380.2269 1397.2001 1471.9269 1478.7697 1479.6959 1491.3760 1638.4168 2981.8924 3002.8398 3011.1323 3050.4502 3069.6600 3087.4763 3091.3713 3567.0966
redmass: 2.5310 2.5644 4.3396 3.5398 1.1094 3.6841 4.6678 4.4320 1.0945 6.9125 11.1853 1.0773 6.2846 1.1521 1.8748 6.5920 2.8818 2.3216 2.2154 1.4645 1.2529 1.0994 1.3396 1.9738 1.6107 1.2365 1.0747 1.0585 1.0411 1.0897 9.0948 1.0361 1.0590 1.0584 1.1017 1.1044 1.0989 1.1059 1.0650
irintensity: 0.0182 0.4053 1.0569 6.5041 0.0071 6.8497 16.3041 29.3231 154.6292 1.1561 33.2819 5.5149 10.0126 2.6768 14.9145 18.7060 18.6475 624.0000 4.0017 0.6588 0.6209 0.0246 23.7972 139.2140 18.9439 5.6959 2.1213 2.5200 13.7627 23.8993 328.4335 28.3899 3.7825 38.9701 1.9206 1.3170 38.6583 88.6654 53.4021
temp: 298.150 k
press: 1.00000 atm
elementType: 8 8 8 6 6 6 6 1 1 1 1 1 1 1 1
symmnumber: 1
zpe: 315741.3 jmol-1
zpe.correction: 0.120259 hartree
zpe.thermalcorrener: 0.128514 hartree
zpe.thermalcorrenthalpy: 0.129458 hartree
zpe.thermalcorrgfe: 0.086725 hartree
zpe.sumelectzpe: -382.322590 hartree
zpe.sumelectthermal: -382.314335 hartree
zpe.sumelectthermalent: -382.313391 hartree
zpe.sumelectthermalfe: -382.356125 hartree
dipole: 1.1825 0.1083 -0.0003
dipole: 1.1874
quadrupole: -32.1889 -49.2716 -41.0118
quadrupole: 1.3016 0.0043 0.0014
quadrupole: 8.6352 -8.4475 -0.1877 1.3016 0.0043 0.0014
hfenergy: -382.4428497 hartree
pointgroup: C01 [X(C4H8O3)]
dipole: -0.4643353 0.0512915 -0.0002743 debye
dipolederiv: -1.7230626 -0.0871518 -0.0008225 -0.2617811 -0.4661571 0.000342 -0.0001609 0.0005401 -0.273521 -1.0304079 0.5298253 -0.0021574 0.5857869 -0.6283244 0.0011779 -0.0025998 0.0012736 -0.4309528 -0.7429391 -0.0883903 -0.000039 -0.1871876 -1.0150793 0.0021753 0.000119 0.0019008 -0.3389892 -0.040557 0.0069399 -0.0000566 0.0203835 0.0671147 0.0003457 -0.0000167 0.0002448 0.1405205 0.9407857 -0.0872603 0.000667 -0.2467561 0.2454859 0.0001644 0.0011499 0.000335 0.3705722 -0.0418764 0.0225872 -0.0000876 -0.0400659 0.0436752 0.0001311 0.0001583 0.000186 0.1000586 2.2689943 -0.1329769 0.0021395 0.1832995 1.5941453 -0.004047 0.001442 -0.0041508 0.3363905 0.0507013 0.0204881 0.0166775 -0.0067069 -0.0103882 -0.106276 0.0119401 -0.1290466 -0.0623929 0.0507333 0.0203963 -0.0167944 -0.0067576 -0.0088361 0.1059137 -0.0119189 0.1286725 -0.0638786 -0.0267278 -0.0009446 0.0197661 0.0613595 -0.0060949 0.0807417 0.0030503 0.1014618 -0.0638754 -0.0267007 -0.0009745 -0.0197598 0.0614157 -0.0073894 -0.0810351 -0.0034572 -0.1018038 -0.0625389 0.0819982 0.0066564 0.0198973 0.0506431 -0.0092592 0.120666 -0.0243856 0.1344754 -0.0837283 -0.1313458 -0.0984819 0.0003709 -0.1248757 0.0077896 0.0003994 0.0004986 0.0003818 0.1077571 0.0820366 0.00641 -0.0200426 0.0507149 -0.011085 -0.1211979 0.0239191 -0.1349985 -0.0819246 0.288368 -0.117123 0.0002414 -0.1394723 0.2044028 0.0004989 0.0002615 0.000528 0.4065028 unknown
polarizability: 72.722628|-0.6089175|51.5235637|0.0270142|-0.0418359|38.4857596 unknown
InChI: InChI=1S/C4H8O3/c1-2-3-7-4(5)6/h5H,2-3H2,1H3
charge 0 multiplicity 1
15 atoms
O  0.367539 -0.569436 0.001718
O  2.576818 -0.905688 0.004984
O  1.787273 1.303636 -0.00282
C  -2.058899 -0.562973 0.000854
C  -0.824197 0.336881 -0.00197
C  -3.356687 0.275708 -0.001812
C  1.582134 0.068202 0.000651
H  -2.028303 -1.222534 -0.885778
H  -2.028275 -1.216895 0.891653
H  -0.77422 0.97805 -0.901375
H  -0.774895 0.9846 0.892759
H  -3.418766 0.920802 -0.897973
H  -4.243431 -0.381797 0.000799
H  -3.41824 0.927187 0.889758
H  3.457149 -0.447443 0.004552
