program: Gaussian 09
title: 000037706
version: EM64L-G09RevD.01
frameworkgroup: C1[X(C8H5Cl2NO4)]
method: RPBEPBE
basis: SDD
operation: Freq
keyword: #p
keyword: freq=noraman
keyword: PBEPBE/SDD
title: #p freq=noraman PBEPBE/SDD
converged: YES YES NO NO
title: Mulliken charges:
elementType: Cl Cl O O O O N C C C C C C C C H H H H H
charge: 0.018842 -0.007270 -0.270582 -0.189367 -0.186434 -0.178093 0.027953 0.407132 0.335468 -0.233143 -0.335410 -0.221790 -0.091386 0.275109 -0.742695 0.315345 0.291872 0.256933 0.250821 0.276695
chargesum: 0.00000
title: Mulliken charges with hydrogens summed into heavy atoms:
elementType: Cl Cl O O O O N C C C C C C C C
charge: 0.018842 -0.007270 -0.270582 -0.189367 -0.186434 -0.178093 0.027953 0.407132 0.335468 -0.233143 -0.020064 0.070083 -0.091386 0.275109 0.041754
polarizability: 1.84600118e+02 -5.65282655e+00 1.46308975e+02 -5.46883721e+00 4.21184235e-01 6.50225457e+01
1716.lowfreq: -1.2814 -0.0028 -0.0021 -0.0013 4.8832 7.8219 14.1651 45.8215 63.6954
frequency: 14.0788 45.8204 63.6942 83.0125 108.0286 119.1538 151.5793 168.0270 176.0829 190.7718 273.1513 309.7160 338.5382 339.2380 372.9841 414.6446 429.7344 472.2966 523.6313 537.6318 584.6685 607.5831 642.6637 690.0283 702.6540 750.6878 772.1523 823.6534 867.5220 877.1171 912.2976 979.4289 1038.7528 1067.5488 1115.6400 1139.0474 1183.9358 1198.4006 1220.8260 1352.4643 1368.9816 1382.8681 1386.1845 1441.0507 1449.5773 1451.8455 1559.4280 1586.3373 1720.3306 3011.3618 3103.7006 3148.8972 3185.6825 3192.0553
redmass: 11.7679 9.9169 3.9638 4.9733 1.1845 10.5986 10.2536 18.6871 14.5477 5.0907 5.1895 11.4788 14.7004 10.5498 9.8523 8.1773 5.5462 5.5997 3.3164 5.3298 5.4540 5.4606 5.9286 11.0879 9.6750 8.7838 9.0464 10.8789 7.6950 1.4495 1.4009 2.4060 1.6299 2.6594 2.7767 3.3957 1.6120 7.8333 4.1239 4.5539 9.6441 1.2556 5.0188 4.1785 1.0526 1.0577 9.4771 8.5133 10.9689 1.0373 1.0956 1.1021 1.0938 1.0928
irintensity: 0.5525 1.1891 3.9488 1.4114 0.2271 0.3254 2.2455 1.4490 1.5056 0.8345 3.1731 2.1627 0.3219 0.9277 1.8547 2.3418 5.4062 5.8038 6.1424 12.9582 16.1776 3.9216 5.0638 20.4044 29.2651 91.5449 111.6061 37.5126 13.7960 30.1014 13.0682 116.5473 7.5500 77.0528 201.1691 202.9221 2.0200 306.5890 32.9552 5.2444 87.3781 71.1346 2.6825 251.9255 22.8249 24.9501 7.9650 18.4273 167.2788 0.1071 3.3701 7.0499 2.6758 12.9091
temp: 298.150 k
press: 1.00000 atm
elementType: 17 17 8 8 8 8 7 6 6 6 6 6 6 6 6 1 1 1 1 1
symmnumber: 1
zpe: 314900.1 jmol-1
zpe.correction: 0.119939 hartree
zpe.thermalcorrener: 0.134492 hartree
zpe.thermalcorrenthalpy: 0.135437 hartree
zpe.thermalcorrgfe: 0.075640 hartree
zpe.sumelectzpe: -1582.437608 hartree
zpe.sumelectthermal: -1582.423055 hartree
zpe.sumelectthermalent: -1582.422111 hartree
zpe.sumelectthermalfe: -1582.481907 hartree
dipole: -0.1444 -2.6958 -1.1903
dipole: 2.9504
quadrupole: -87.9905 -106.9771 -104.1671
quadrupole: -2.1545 -3.3951 1.0929
quadrupole: 11.7210 -7.2655 -4.4555 -2.1545 -3.3951 1.0929
hfenergy: -1582.5575472 hartree
pointgroup: C01 [X(C8H5Cl2N1O4)]
dipole: -0.0810154 -1.0335819 -0.522096 debye
dipolederiv: -0.1484778 0.2200069 0.0375764 0.2060266 -0.605273 -0.0836415 0.0283366 -0.0763857 -0.028074 -0.8127687 0.0356401 0.0820741 0.0555537 -0.0954146 -0.0118279 0.105395 -0.0114461 -0.0470337 -1.9484231 0.1823294 -0.4310168 -0.0065595 -0.2489483 -0.0350289 -0.4097853 -0.0409813 -0.6240719 -0.5115388 0.0900179 -0.0371558 0.1423012 -0.8726212 0.0601042 -0.0279729 0.0356913 -0.2212652 -0.8103568 -0.0539525 -0.0448405 -0.0897723 -0.4697407 0.0249329 -0.0224353 0.0509732 -0.1855762 -0.5730685 0.0164132 0.1923141 -0.010557 -0.2565178 -0.0237494 -0.4089069 0.0551267 -0.93639 1.197271 0.2738998 0.0919643 0.1544022 1.5847095 -0.1064201 0.0547912 -0.0854731 0.1868648 1.0222925 -0.1487932 0.1129174 0.1473889 0.0490996 -0.0615229 -0.274669 0.0074237 0.0271436 -0.105843 -0.409373 -0.056035 -0.2598158 -0.4529095 0.034682 0.0333339 0.0180865 0.0876772 -0.0692887 -0.3801695 -0.1041091 -0.4185752 0.9878062 0.1497279 -0.0484072 0.1503016 -0.0331592 -0.360865 0.2835537 0.020632 -0.071026 -0.0468468 0.0093188 0.0499833 -0.0055051 -0.0621092 -0.2615627 0.1105356 0.0484847 0.1016665 -0.1200976 -0.0467097 0.0339649 -0.0242873 -0.0323928 1.3405092 -0.0917255 -0.1606994 -0.0474169 -0.0640973 0.039498 -0.1896082 0.020771 -0.0434005 1.9835178 -0.0997329 0.1695591 0.1105163 0.2604743 0.0604896 1.0200053 -0.0741054 1.499195 -0.3955051 -0.0075531 0.1219056 -0.0910338 -0.0038166 0.0369439 0.1756668 0.0105311 -0.1026231 0.1288684 -0.0030943 0.0049812 0.0390796 0.1191817 -0.01169 -0.0033424 -0.0124754 0.1782519 0.0858527 -0.0306185 0.0034921 -0.0292788 0.0686751 -0.0038708 0.0084166 -0.0108753 0.1637711 0.1123007 -0.0261447 -0.0088107 0.0377552 0.0379488 -0.1021457 -0.0122108 -0.0884433 0.0535149 -0.006941 0.0219431 -0.0542275 0.0382092 0.1250728 0.011835 -0.0936952 0.0247095 0.0039803 0.1340269 0.0168176 0.0109939 -0.008864 0.0033153 0.0590746 -0.0188605 0.0563633 0.1156972 unknown
polarizability: 184.3413672|-6.3319228|146.344884|-5.2861566|4.6868112|65.245387 unknown
InChI: InChI=1S/C8H5Cl2NO4/c1-4(12)15-8-6(10)2-5(9)3-7(8)11(13)14/h2-3H,1H3
charge 0 multiplicity 1
20 atoms
Cl 0.042974 -3.24652 -0.475163
Cl -4.409057 -0.054692 0.336086
O  1.531189 -0.660413 -0.546441
O  -0.301062 3.170005 -0.222921
O  1.643325 1.99973 -0.07455
O  2.11535 -0.467998 1.72422
N  0.357272 2.063753 -0.134494
C  0.172605 -0.475492 -0.273315
C  -0.432601 0.802403 -0.101956
C  -0.680118 -1.607582 -0.259697
C  -1.82692 0.941921 0.07883
C  -2.069976 -1.49741 -0.077786
C  -2.622102 -0.211601 0.09346
C  2.485588 -0.542742 0.548686
C  3.872114 -0.548615 -0.024657
H  -2.248622 1.942626 0.196461
H  -2.700027 -2.39001 -0.065499
H  3.967579 -1.319311 -0.806352
H  4.608925 -0.712468 0.774393
H  4.055466 0.433218 -0.497307
