program: Gaussian 09
title: 000037705
version: EM64L-G09RevD.01
frameworkgroup: C1[X(C16H24O6)]
method: RPBEPBE
basis: SDD
operation: Freq
keyword: #pfreq=noraman
keyword: PBEPBE/SDD
title: #p freq=noraman PBEPBE/SDD
converged: YES YES NO NO
title: Mulliken charges:
elementType: O O O O O O C C C C C C C C C C C C C C C C H H H H H H H H H H H H H H H H H H H H H H H H
charge: -0.275106 -0.242063 -0.266609 -0.260484 -0.267209 -0.242961 0.001137 -0.059546 -0.075261 0.082018 -0.305747 -0.298554 -0.326346 -0.312767 -0.059531 -0.056910 -0.044677 -0.040520 -0.559895 -0.564144 -0.555172 -0.578485 0.230957 0.249839 0.251903 0.175286 0.204888 0.225161 0.192607 0.259546 0.192196 0.200904 0.226113 0.191513 0.235411 0.227210 0.231411 0.250971 0.221368 0.217866 0.214392 0.228500 0.221956 0.217688 0.220707 0.220439
chargesum: 0.00000
title: Mulliken charges with hydrogens summed into heavy atoms:
elementType: O O O O O O C C C C C C C C C C C C C C C C
charge: -0.275106 -0.242063 -0.266609 -0.260484 -0.267209 -0.242961 0.232094 0.190293 0.176642 0.257304 0.124302 0.153599 0.066754 0.104859 0.175881 0.170300 0.186734 0.210451 -0.120662 -0.121252 -0.115529 -0.137339
polarizability: 2.51818551e+02 -1.72898276e+01 2.18007522e+02 -4.08025382e+00 -1.75990133e+01 1.29544163e+02
1716.lowfreq: 0.0004 0.0006 0.0006 4.4583 5.1469 7.4344 14.8408 22.9270 29.4470
frequency: 14.1680 22.9136 29.4133 39.4019 48.1919 50.8471 53.7749 62.2909 66.8615 69.3130 89.1561 95.6518 101.7122 109.1705 110.1157 130.5758 151.1649 181.5013 191.3414 217.9344 243.5780 247.2972 259.3583 288.9869 299.7292 309.3132 350.8178 402.2916 416.5077 432.4617 438.5669 459.3047 529.3307 546.2857 565.6241 606.3771 624.6356 643.2389 657.4492 690.5963 717.8481 748.9472 817.5702 862.2872 877.5524 891.8650 903.6135 908.3945 912.0118 918.2869 928.9271 939.2280 948.1880 951.4161 953.1900 954.4901 959.9709 963.6040 970.9917 972.1140 977.1406 982.1685 984.7128 1007.2422 1009.1490 1010.4638 1017.3874 1029.0744 1033.5742 1059.4354 1083.5552 1134.5248 1146.0783 1147.1272 1149.7571 1152.1195 1206.0182 1214.2685 1215.2089 1219.7609 1227.7734 1251.7561 1279.7630 1280.0374 1281.3247 1282.5758 1283.5003 1294.9498 1299.6904 1314.0903 1318.2361 1343.5651 1353.4456 1356.2975 1374.6502 1379.3325 1431.0433 1432.9236 1433.9146 1434.2492 1468.9790 1471.6538 1472.1094 1473.1575 1662.2507 1664.4363 1665.3920 1665.8762 2873.5018 2905.7344 2916.0514 2929.8307 2952.1354 2982.3530 3007.9432 3011.6891 3028.5406 3032.7831 3047.7554 3061.7090 3089.2324 3089.5775 3091.5317 3091.9858 3112.3582 3119.0185 3120.0554 3120.9697 3198.0594 3200.0974 3201.6116 3202.2106
redmass: 4.8209 4.3164 4.1967 4.5106 1.9604 3.0743 3.9126 2.8000 2.7235 2.7308 3.5373 2.7944 3.3630 2.9477 3.1397 3.5059 3.5409 3.8279 3.5595 3.8705 4.1061 4.6697 6.0346 4.1073 2.9900 5.0475 3.5796 2.5519 2.5550 2.6713 2.6235 3.3997 2.8009 3.3601 3.1062 1.7447 1.6014 1.9121 2.1957 3.7541 7.7422 5.9982 4.5335 5.8374 3.2125 3.2561 3.1494 2.5794 2.0545 2.8613 2.0664 1.7082 1.4333 1.3742 1.3944 1.4140 3.0642 1.7960 2.3058 2.7562 1.7500 1.8417 3.2313 1.2461 1.2705 1.2836 1.2526 3.1387 3.2686 4.3177 4.0370 3.1417 1.7097 1.6123 1.7352 1.7110 1.2830 1.2244 1.2579 1.1999 1.1941 1.2712 1.3001 1.2431 1.2952 1.2656 1.2404 1.2019 1.1459 1.2521 1.2537 1.3398 1.3283 1.2874 1.4190 1.3559 1.1964 1.1949 1.2041 1.2085 1.0946 1.0917 1.1016 1.0956 4.7802 4.7539 4.7809 4.8061 1.0816 1.0614 1.0653 1.0670 1.0552 1.0981 1.0866 1.1059 1.0867 1.0946 1.0872 1.0943 1.0606 1.0599 1.0605 1.0605 1.0943 1.0946 1.0945 1.0945 1.1142 1.1147 1.1142 1.1143
irintensity: 0.1424 0.1232 0.5810 0.4786 1.3166 0.3818 0.0393 0.7801 2.8163 2.1046 1.4569 0.9769 0.3162 1.9235 0.6940 2.6920 5.8716 6.0964 7.5138 2.3854 0.2833 8.9905 2.0963 12.8762 5.5917 2.1934 2.0688 0.1948 3.8680 2.1416 3.9424 8.1263 5.3470 7.5188 4.2658 14.9071 11.3015 2.3370 5.1141 5.7488 3.8943 65.0858 80.1021 160.0004 52.5217 165.9968 89.8860 10.7116 76.9880 110.0077 126.4246 74.9550 9.1568 39.6670 259.9775 38.3891 30.7261 11.0559 89.5225 20.5518 3.6364 89.9110 118.1487 13.6075 94.2497 23.3840 21.9276 7.9443 145.8088 246.2279 181.9620 93.0249 11.4005 5.8378 7.5767 3.1243 4.9115 0.6061 1.6919 11.9516 5.8712 12.4040 1.1796 1.4839 0.6135 1.4306 0.2353 4.2827 20.7881 7.0956 13.3185 9.3664 7.6872 5.5682 6.6274 10.6534 28.1348 15.1951 10.5047 7.2761 3.3839 7.7836 6.6563 2.9383 7.3088 1.3241 5.4024 5.0654 45.2016 45.5650 71.5351 46.8653 42.1362 41.2033 52.7439 37.4878 40.3366 24.1365 22.8884 8.5552 13.7495 6.8866 10.8701 10.5709 12.8405 8.2015 7.4048 5.2832 36.6112 16.2435 25.7148 25.3936
temp: 298.150 k
press: 1.00000 atm
elementType: 8 8 8 8 8 8 6 6 6 6 6 6 6 6 6 6 6 6 6 6 6 6 1 1 1 1 1 1 1 1 1 1 1 1 1 1 1 1 1 1 1 1 1 1 1 1
symmnumber: 1
zpe: 976812.0 jmol-1
zpe.correction: 0.372048 hartree
zpe.thermalcorrener: 0.397641 hartree
zpe.thermalcorrenthalpy: 0.398585 hartree
zpe.thermalcorrgfe: 0.311595 hartree
zpe.sumelectzpe: -1073.532916 hartree
zpe.sumelectthermal: -1073.507322 hartree
zpe.sumelectthermalent: -1073.506378 hartree
zpe.sumelectthermalfe: -1073.593369 hartree
dipole: 0.1462 1.3981 2.3945
dipole: 2.7766
quadrupole: -116.0807 -117.6326 -134.8720
quadrupole: -0.2950 -0.0935 1.4966
quadrupole: 6.7811 5.2292 -12.0103 -0.2950 -0.0935 1.4966
hfenergy: -1073.9049636 hartree
pointgroup: C01 [X(C16H24O6)]
dipole: 0.0200307 -0.485875 0.9782006 debye
polarizability: 255.3819014|-12.6228301|216.5888737|1.1148084|12.0362051|127.3994606 unknown
InChI: InChI=1S/C16H24O6/c1-5-9-17-13(18-10-6-2)16-21-14(19-11-7-3)15(22-16)20-12-8-4/h5-8,13-16H,1-4,9-12H2
charge 0 multiplicity 1
46 atoms
O  1.394957 -0.148556 0.842077
O  0.488744 0.060118 -1.329156
O  3.339954 0.697631 -0.343848
O  0.199032 2.358216 -0.518877
O  -1.430527 -2.305156 -0.218427
O  -1.657495 -0.040718 0.401596
C  0.562898 -0.827807 -0.174693
C  2.039317 1.009559 0.199244
C  1.113848 1.352136 -0.980066
C  -0.796256 -1.169926 0.479563
C  4.342562 0.377273 0.705213
C  -0.88807 2.650115 -1.490235
C  -1.125685 -3.621354 0.384479
C  -2.873828 -0.177138 1.24105
C  5.588886 -0.103619 0.013297
C  -1.48279 3.983822 -1.124431
C  -2.066066 -4.631493 -0.218773
C  -3.58171 1.15143 1.234951
C  6.835459 0.361092 0.272599
C  -2.812064 4.208573 -0.977873
C  -1.677856 -5.820498 -0.740378
C  -4.913234 1.301087 1.029296
H  1.052894 -1.761946 -0.511336
H  2.081997 1.797723 0.972013
H  1.647988 1.66372 -1.897372
H  -0.600478 -1.467154 1.541083
H  4.542216 1.277718 1.322764
H  3.921081 -0.416508 1.356337
H  -0.447963 2.686078 -2.512828
H  -1.627062 1.831583 -1.448197
H  -1.278949 -3.556348 1.487312
H  -0.070131 -3.912003 0.200242
H  -3.513643 -0.987735 0.844793
H  -2.554577 -0.443301 2.275381
H  5.433379 -0.899927 -0.727283
H  -0.762162 4.804836 -1.001455
H  -3.127794 -4.349588 -0.20141
H  -2.942299 2.023211 1.430485
H  7.715947 -0.050463 -0.232439
H  7.013086 1.165834 0.996993
H  -3.202151 5.208076 -0.754451
H  -3.544356 3.398549 -1.081731
H  -2.405488 -6.534542 -1.14074
H  -0.621657 -6.114171 -0.785884
H  -5.390996 2.285862 1.076387
H  -5.565358 0.445409 0.813128
