program: Gaussian 09
title: 000037704
version: EM64L-G09RevD.01
frameworkgroup: C1[X(C22H29NO)]
method: RPBEPBE
basis: SDD
operation: Freq
keyword: #p
keyword: freq=noraman
keyword: PBEPBE/SDD
title: #p freq=noraman PBEPBE/SDD
converged: YES YES NO NO
title: Mulliken charges:
elementType: O N C C C C C C C C C C C C C C C C C C C C C C H H H H H H H H H H H H H H H H H H H H H H H H H H H H H
charge: -0.432340 -0.073946 0.068648 -0.461832 -0.458315 -0.410974 -0.403161 -0.380001 -0.347428 -0.478715 -0.282189 -0.593691 0.423517 0.537603 -0.447798 -0.393892 -0.413114 -0.417144 -0.222392 -0.227615 -0.229078 -0.227886 -0.240383 -0.245671 0.158826 0.198901 0.213149 0.212479 0.204554 0.197346 0.189024 0.188944 0.197628 0.195625 0.190997 0.241276 0.183163 0.248723 0.270166 0.203978 0.206175 0.216028 0.339658 0.231334 0.270167 0.219538 0.227165 0.227107 0.227219 0.220982 0.221744 0.229743 0.226158
chargesum: 0.00000
title: Mulliken charges with hydrogens summed into heavy atoms:
elementType: O N C C C C C C C C C C C C C C C C C C C C C C
charge: -0.092682 -0.073946 0.227475 -0.049781 -0.041283 -0.024605 -0.016588 0.006621 0.077011 0.040174 -0.078211 -0.171488 0.423517 0.537603 -0.216464 -0.123725 -0.193577 -0.189978 0.004715 -0.000396 -0.008096 -0.006142 -0.010640 -0.019513
polarizability: 3.03063643e+02 1.08393350e+01 2.69788543e+02 -9.33225945e+00 7.93356141e+00 1.68264779e+02
1716.lowfreq: -12.3450 -5.3523 -0.0007 -0.0004 -0.0002 8.2939 13.7538 17.9921 25.3366
frequency: 13.2150 16.2003 25.2220 27.0080 33.4400 49.7294 55.3508 75.3684 89.4032 123.0033 137.6524 167.9567 201.6760 212.7400 227.9791 256.3374 260.8673 301.7942 323.8997 345.1609 350.9124 365.4519 369.6005 404.2315 404.5028 418.5610 429.1670 465.1889 471.3242 498.2100 504.0353 544.5898 565.3238 611.0498 616.6092 617.7629 630.3036 704.6262 706.5340 752.4150 763.7778 769.9759 781.8086 784.0290 811.7188 818.1523 843.4496 851.8612 855.7982 858.5716 878.4692 895.0104 895.1977 905.0304 923.3172 926.1370 960.9957 972.6669 975.2891 978.6843 989.0715 989.2954 991.6339 997.1414 1011.0170 1023.0604 1025.2680 1027.3854 1031.5618 1053.4295 1061.1207 1075.5630 1081.1144 1083.9071 1111.7606 1116.8826 1142.6690 1148.5139 1170.7663 1171.8333 1180.7296 1183.5708 1185.3114 1206.6979 1212.3569 1221.7550 1231.2508 1240.5853 1254.7057 1261.2116 1270.0973 1273.4685 1296.5862 1300.1289 1306.1693 1318.1641 1325.4270 1330.7846 1331.1999 1335.9318 1339.0478 1340.3766 1343.6359 1346.7083 1373.8885 1382.0268 1387.8039 1393.0112 1439.5473 1440.3638 1459.4180 1461.1506 1463.3936 1466.2057 1469.6295 1477.4021 1478.9742 1480.3930 1481.7391 1509.2604 1589.9320 1593.7383 1611.6786 1612.3430 2788.3023 2836.2949 2944.8682 2962.6255 2963.4679 2968.7056 2974.4991 2980.8219 2982.2336 3020.8836 3024.6155 3026.8797 3032.3270 3032.8224 3036.2504 3042.8897 3052.9454 3073.7665 3106.1401 3110.5425 3111.1619 3124.8532 3128.4581 3136.9475 3140.2177 3148.1874 3160.3645 3163.3599 3544.4070
redmass: 3.5272 4.4482 3.7752 3.4383 4.3943 4.2744 4.2477 3.9601 4.2120 3.0034 3.8603 3.7963 3.1080 2.2936 4.2269 3.5217 3.4527 2.3902 2.0121 2.1220 1.8098 3.2063 1.8441 2.7668 2.8118 3.1565 2.9596 3.1117 1.9276 2.7973 2.7946 3.0112 3.3923 4.6897 5.9024 6.2925 4.2031 1.7784 1.7668 1.8901 2.0713 2.0351 1.3434 1.4332 3.6608 3.4993 2.6744 1.2554 1.3185 1.9331 2.1641 1.5340 1.8328 1.7406 1.5616 1.9706 3.7793 1.5542 2.0711 1.3888 6.2740 6.2073 1.3279 1.3174 1.8854 2.2853 2.1929 2.6808 2.2804 1.2563 1.8437 1.8075 1.4254 1.6078 1.6020 2.2629 2.2656 2.3488 1.0540 1.0616 1.2068 1.2325 1.1122 2.3309 1.7531 2.0513 1.5808 1.3251 1.2682 1.2304 1.3208 1.3255 1.3025 1.2277 1.2540 1.3221 1.2702 1.3870 1.4230 1.2200 1.4703 1.4116 1.5256 1.3803 1.4473 7.9300 5.9919 1.4307 2.1861 2.1285 1.0861 1.0903 1.0886 1.0921 1.0861 1.1110 1.4085 1.5986 2.2009 1.0788 5.9944 6.0700 6.1308 6.1578 1.0792 1.0710 1.0826 1.0628 1.0622 1.0633 1.0613 1.0588 1.0620 1.0659 1.0954 1.0949 1.0927 1.0973 1.0995 1.1003 1.0990 1.1024 1.0877 1.0870 1.0879 1.0858 1.0898 1.0910 1.0954 1.0958 1.1013 1.1014 1.0658
irintensity: 0.0272 0.1395 0.0196 0.0755 0.3996 0.4757 0.6834 0.1729 0.1103 0.3903 0.4517 0.4105 1.6568 0.5366 1.4398 0.2900 3.5378 2.8895 34.3821 1.9971 44.4608 7.8491 82.0575 1.9470 0.6427 1.6218 0.6702 4.5606 0.8419 15.3452 9.5305 24.3063 0.2772 5.5462 2.6183 0.5274 17.9255 36.1974 58.3281 35.7781 39.6684 19.7413 3.8275 1.1570 3.2423 22.7520 13.4931 0.4909 3.6000 22.9825 6.1414 11.4273 1.1446 16.2036 6.8954 0.6426 39.7787 4.2834 13.8949 0.0753 0.1342 0.3771 1.0718 0.6066 10.8304 20.6773 7.7049 42.4719 8.7589 5.2861 3.4174 10.4725 12.8470 3.8178 41.3754 3.6720 29.6371 33.8516 0.3132 0.1911 1.9910 10.0968 0.8004 6.8028 36.6686 10.2577 4.6666 1.6681 5.1140 7.9317 14.7352 14.1039 8.4536 10.1261 4.7479 1.2670 0.3181 5.0507 6.4440 26.6745 14.9168 5.3515 0.5432 1.8167 17.3497 1.1852 0.9606 7.2576 6.6225 16.2843 1.7479 6.6021 6.7683 9.1856 23.8077 5.6750 4.0071 6.4270 37.0736 23.0593 1.0274 0.7720 7.0778 25.9984 68.5040 92.5694 49.7062 29.4419 45.4683 39.9607 20.5139 27.0568 25.5486 18.6912 77.5886 80.3032 23.6897 13.8813 36.6061 85.5946 71.8150 34.0147 20.1483 14.8060 12.2236 0.1740 7.9337 16.6926 47.6299 28.4019 28.7925 25.0669 5.8723
temp: 298.150 k
press: 1.00000 atm
elementType: 8 7 6 6 6 6 6 6 6 6 6 6 6 6 6 6 6 6 6 6 6 6 6 6 1 1 1 1 1 1 1 1 1 1 1 1 1 1 1 1 1 1 1 1 1 1 1 1 1 1 1 1 1
symmnumber: 1
zpe: 1201977.7 jmol-1
zpe.correction: 0.457809 hartree
zpe.thermalcorrener: 0.480710 hartree
zpe.thermalcorrenthalpy: 0.481655 hartree
zpe.thermalcorrgfe: 0.401234 hartree
zpe.sumelectzpe: -983.891414 hartree
zpe.sumelectthermal: -983.868513 hartree
zpe.sumelectthermalent: -983.867569 hartree
zpe.sumelectthermalfe: -983.947989 hartree
dipole: 1.1524 -0.6064 -1.2337
dipole: 1.7938
quadrupole: -131.4781 -137.4367 -150.1601
quadrupole: -4.8976 -0.9511 -2.1085
quadrupole: 8.2135 2.2549 -10.4684 -4.8976 -0.9511 -2.1085
hfenergy: -984.3492236 hartree
pointgroup: C01 [X(C22H29N1O1)]
dipole: 0.448786 0.2382266 0.4898101 debye
polarizability: 300.8861808|-12.1342052|271.5594358|15.0754952|1.6506095|168.6713482 unknown
InChI: InChI=1S/C22H29NO/c24-22(20-12-6-2-7-13-20)18-23(21-14-8-3-9-15-21)17-16-19-10-4-1-5-11-19/h1-2,4-7,10-13,21-22,24H,3,8-9,14-18H2
charge 0 multiplicity 1
53 atoms
O  1.762403 0.218295 -2.139108
N  -0.260491 -1.160435 -0.493061
C  -0.825364 -2.325471 0.262249
C  -2.256595 -2.681571 -0.219234
C  0.088317 -3.574611 0.112799
C  -2.828517 -3.92478 0.503653
C  -0.484919 -4.819272 0.831308
C  -1.910439 -5.15533 0.342354
C  1.103831 -0.801872 -0.036504
C  -1.16588 -0.014582 -0.705808
C  1.726512 0.45294 -0.68299
C  -1.60512 0.775388 0.584033
C  3.123325 0.701448 -0.114767
C  -2.516172 1.935936 0.234843
C  3.327576 1.674693 0.893998
C  4.230588 -0.052948 -0.580754
C  -1.981097 3.211867 -0.086807
C  -3.923605 1.760843 0.156859
C  4.614281 1.886679 1.439037
C  5.517694 0.1600 -0.039911
C  -2.822385 4.279577 -0.471619
C  -4.769886 2.825085 -0.227156
C  5.713311 1.128411 0.973278
C  -4.222296 4.090262 -0.54395
H  -0.885245 -2.088435 1.361411
H  -2.948137 -1.833883 -0.055876
H  -2.21781 -2.865896 -1.31222
H  0.207136 -3.777847 -0.970596
H  1.096198 -3.371329 0.518353
H  -3.841226 -4.141974 0.111752
H  -2.946756 -3.699423 1.584312
H  -0.511597 -4.632378 1.925441
H  0.193607 -5.679865 0.672801
H  -2.319099 -6.01921 0.901818
H  -1.873021 -5.448523 -0.727014
H  1.787037 -1.638726 -0.264729
H  1.148467 -0.644096 1.07356
H  -2.07397 -0.363506 -1.225679
H  -0.679171 0.682854 -1.410038
H  1.101075 1.345728 -0.463216
H  -0.701207 1.142504 1.108565
H  -2.118916 0.076775 1.271956
H  2.271311 0.959244 -2.558842
H  2.478068 2.270285 1.252955
H  4.072996 -0.795461 -1.371205
H  -0.896067 3.369813 -0.026268
H  -4.357514 0.784123 0.40762
H  4.760778 2.642549 2.218833
H  6.367973 -0.426305 -0.406711
H  -2.389611 5.258093 -0.710316
H  -5.854081 2.670599 -0.275464
H  6.712517 1.293923 1.391649
H  -4.877309 4.917811 -0.838793
